{"text_format":"3","workbook":"xlsx","n_sheets":8,"sheets":["Ermittlung Schneelast","Bemessungstabelle isoliert","Satteldach isoliert","Bemessungstabelle unisoliert","Satteldach unisoliert","Daten","Info","Statiktabellen"],"not_rendered":{"images":12,"macros":1,"defined_names":29,"comments":1},"read":"whole","date_system":"1900"}

{"sheet":"Ermittlung Schneelast","index":0,"n_rows":56,"n_cols":9,"rows_kept":56,"merged":[[3,1,3,5],[8,1,8,5],[10,3,10,5],[12,1,12,5]]}
[]
[]
[]
[null,"Ermittlung der standortbezogenen Wind- und Schneelast",{"$nulls":4},"Schneelast auf dem Boden"]
[{"$nulls":6},"Schneelastzone","sk","Bedingung"]
[null,"Kunde:",{"$nulls":4},"1",{"$f":"0.19+0.91*((D16+140)/760)^2","v":{"v":0.2807479224376731,"d":"0.281"}},{"$f":"IF(H6<0.65,0.65,H6)","v":{"v":0.65,"d":"0.650"}}]
[null,"BV:",{"$nulls":4},"2",{"$f":"0.25+1.91*((D16+140)/760)^2","v":{"v":0.4404709141274238,"d":"0.440"}},{"$f":"IF(H7<0.85,0.85,H7)","v":{"v":0.85,"d":"0.850"}}]
[{"$nulls":6},"3",{"$f":"0.31+2.91*((D16+140)/760)^2","v":{"v":0.6001939058171746,"d":"0.600"}},{"$f":"IF(H8<1.1,1.1,H8)","v":{"v":1.1,"d":"1.100"}}]
[null,"Windlast",{"$nulls":4},"1a",{"$f":"1.25*I6","v":{"v":0.8125,"d":"0.813"}},{"$f":"H9","v":{"v":0.8125,"d":"0.813"}}]
[{"$nulls":6},"2a",{"$f":"1.25*I7","v":{"v":1.0625,"d":"1.063"}},{"$f":"H10","v":{"v":1.0625,"d":"1.063"}}]
[null,"Windzone WZ","=","1, Binnenland",null,null,"3a",{"$f":"I8*1.25","v":1.375},{"$f":"H11","v":1.375}]
[{"$nulls":7},"sk",{"$f":"IF(D15=\"1\",I6,IF(D15=\"2\",I7,IF(D15=\"3\",I8,IF(D15=\"1a\",I9,IF(D15=\"2a\",I10,IF(D15=\"3a\",I11,0))))))","v":{"v":1.375,"d":"1.375 kN/qm"}}]
[null,"Schneelast"]
[]
[null,"Schneelastzone","=","3a"]
[null,"Höhe des Bauortes","=",{"v":100,"d":"100 m"}]
[null,"Norddeutsches Tiefland","=","nein"]
[null,"Dachneigung des Anbaus","=",{"v":10,"d":"10.0°"}]
[null,"Tiefe des Anbaus b2","=",{"v":3.5,"d":"3.50 m"}]
[null,"Anbaudach seitlich offen und für Räumung zugänglich","=","ja",null,null,"rechnerisch bS","=",{"$f":"IF(OR(_x<=15,D27=\"vorhanden\",D23=\"Dach an der Giebelseite\",D23=\"Dach an ein Flachdach\"),0,_bs)","v":{"v":4.5,"d":"4.50 m"}}]
[]
[null,"mittlerer Höhenversprung h","=",{"v":0.3,"d":"0.30 m"}]
[null,"Anbausituation","=","Dach an der Traufseite"]
[null,"Tiefe des vorh. Gebäudes (oft \"Firstlänge\") b1","=",{"v":9,"d":"9.00 m"}]
[null,"Tiefe der Dachfläche des vorh. Gebäudes bS","=",{"v":4.5,"d":"4.50 m"}]
[null,"Dachneigung des vorh. Gebäudes x","=",{"v":38,"d":"38.0°"}]
[null,"Schneefanggitter auf vorh. Gebäude","=","nicht vorhanden"]
[]
[null,"Schneelast auf dem Boden sk","=",{"$f":"sk","v":{"v":1.375,"d":"1.375 kN/qm"}}]
[null,"my1","=",{"$f":"IF(D18<30,0.8,IF(D18>60,0,0.8*(60-D18)/30))","v":{"v":0.8,"d":"0.800"}}]
[null,"länge Schneekeil Ls","=",{"$f":"IF(2*_h<5,5,IF(2*_h>15,15,2*_h))","v":{"v":5,"d":"5.00 m"}}]
[null,"mys","=",{"$f":"0.8*I20/ls","v":{"v":0.72,"d":"0.720"}}]
[null,"myw","=",{"$f":"IF(_h<=0.5,0,(_b1+_b2)/(2*_h))","v":{"v":0,"d":"0.000"}}]
[null,"my2,1","=",{"$f":"IF(_h<=0.5,D30+D32,D33+D32)","v":{"v":1.52,"d":"1.520"}}]
[null,"my2,2","=",{"$f":"IF(AND(_b2<=3,D20=\"ja\"),2,2.4)","v":{"v":2.4,"d":"2.400"}}]
[null,"my2,3","=",{"$f":"2*_h/D29","v":{"v":0.43636363636363634,"d":"0.436"}}]
[null,"my2,4","=",{"$f":"D30+1.6*_b1/ls","v":{"v":3.6799999999999997,"d":"3.680"}}]
[null,"my2,5","=",{"$f":"MIN(D34,D35,D36,D37)","v":{"v":0.43636363636363634,"d":"0.436"}}]
[null,"my2","=",{"$f":"IF(D33+D32=0,D30,MAX(0.8,D38))","v":{"v":0.8,"d":"0.800"}}]
[]
[null,"Schneelasten auf dem Dach: Normal"]
[null,"Grundschneelast auf dem Dach s1","=",{"$f":"D29*D30","v":{"v":1.1,"d":"1.100 kN/qm"}}]
[null,"Schneelast oben so","=",{"$f":"D29*D39","v":{"v":1.1,"d":"1.100 kN/qm"}}]
[null,"Schneelast unten su","=",{"$f":"MAX(D42,D42+(D43-D42)*(ls-_b2)/ls)","v":{"v":1.1,"d":"1.100 kN/qm"}}]
[null,"Schneelast im Mittel sm","=",{"$f":"IF(_b2<ls,(D43+D44)/2,D44+(D43-D44)*ls/(2*_b2))","v":{"v":1.1,"d":"1.100 kN/qm"}}]
[]
[null,"Schneelasten auf dem Dach: Außergewöhnlich (Norddeutsches Tiefland)"]
[null,"Grundschneelast auf dem Dach sAd,1","=",{"$f":"2.3*D42","v":{"v":2.53,"d":"2.530 kN/qm"}}]
[null,"Schneelast oben sAd,o","=",{"$f":"IF((2.3*D43)<=(4*D29),2.3*D43,4*D29)","v":{"v":2.53,"d":"2.530 kN/qm"}}]
[null,"Schneelast unten sAd,u","=",{"$f":"MAX(D48,D48+(D49-D48)*(ls-_b2)/ls)","v":{"v":2.53,"d":"2.530 kN/qm"}}]
[null,"Schneelast im Mittel sAd,m","=",{"$f":"IF(_b2<=ls,(D49+D50)/2,D50+(D49-D50)*ls/(2*_b2))","v":{"v":2.53,"d":"2.530 kN/qm"}}]
[]
[null,"normale Schneelast sDa","=",{"$f":"IF(D56=\"\",IF(_h>0.5,D45*0.9,D45),D56)","v":{"v":1.1,"d":"1.10 kN/qm"}}]
[null,"außergewöhnliche Schneelast sa","=",{"$f":"IF(D17=\"ja\",D51*0.9,\"nur erforderlich für Norddeutsches Tiefland\")","v":"nur erforderlich für Norddeutsches Tiefland"}]
[]
[null,"gewählte normale Schneelast sDa","="]

{"sheet":"Bemessungstabelle isoliert","index":1,"n_rows":102,"n_cols":86,"rows_kept":102,"merged":[[0,6,0,7],[0,33,0,34],[0,60,0,61],[23,6,23,7],[23,33,23,34],[23,60,23,61],[40,6,40,7],[40,33,40,34],[40,60,40,61],[64,6,64,7],[64,33,64,34],[64,60,64,61],[83,6,83,7],[83,33,83,34]]}
[null,"Kunde:",null,{"$f":"'Ermittlung Schneelast'!D6","v":{"v":0,"d":"0.00"}},null,null,"1a) Korrekturfaktoren Träger",null,null,"1a) sDA","1a) ki",null,"Träger",{"v":0.5,"d":"0.50 m"},{"$f":"IF(AND($D$12>0.5,$D$12<0.6),$D$12,0)","v":{"v":0,"d":"0.00 m"}},{"v":0.6,"d":"0.60 m"},{"$f":"IF(AND($D$12>0.6,$D$12<0.7),$D$12,0)","v":{"v":0,"d":"0.00 m"}},{"v":0.7,"d":"0.70 m"},{"$f":"IF(AND($D$12>0.7,$D$12<0.8),$D$12,0)","v":{"v":0.73,"d":"0.73 m"}},{"v":0.8,"d":"0.80 m"},{"$f":"IF(AND($D$12>0.8,$D$12<0.9),$D$12,0)","v":{"v":0,"d":"0.00 m"}},{"v":0.9,"d":"0.90 m"},{"$f":"IF(AND($D$12>0.9,$D$12<1),$D$12,0)","v":{"v":0,"d":"0.00 m"}},{"v":1,"d":"1.00 m"},{"$f":"IF(AND($D$12>1,$D$12<1.1),$D$12,0)","v":{"v":0,"d":"0.00 m"}},{"v":1.1,"d":"1.10 m"},{"$nulls":7},"1b) Korrekturfaktoren Träger",null,null,"1b) sDA","1b) ki",null,"Träger",{"v":0.5,"d":"0.50 m"},{"$f":"IF(AND($D$12>0.5,$D$12<0.6),$D$12,0)","v":{"v":0,"d":"0.00 m"}},{"v":0.6,"d":"0.60 m"},{"$f":"IF(AND($D$12>0.6,$D$12<0.7),$D$12,0)","v":{"v":0,"d":"0.00 m"}},{"v":0.7,"d":"0.70 m"},{"$f":"IF(AND($D$12>0.7,$D$12<0.8),$D$12,0)","v":{"v":0.73,"d":"0.73 m"}},{"v":0.8,"d":"0.80 m"},{"$f":"IF(AND($D$12>0.8,$D$12<0.9),$D$12,0)","v":{"v":0,"d":"0.00 m"}},{"v":0.9,"d":"0.90 m"},{"$f":"IF(AND($D$12>0.9,$D$12<1),$D$12,0)","v":{"v":0,"d":"0.00 m"}},{"v":1,"d":"1.00 m"},{"$f":"IF(AND($D$12>1,$D$12<1.1),$D$12,0)","v":{"v":0,"d":"0.00 m"}},{"v":1.1,"d":"1.10 m"},{"$nulls":7},"1c) Korrekturfaktoren Träger",null,null,"1c) sA","1c) ki",null,"Träger",{"v":0.5,"d":"0.50 m"},{"$f":"IF(AND($D$12>0.5,$D$12<0.6),$D$12,0)","v":{"v":0,"d":"0.00 m"}},{"v":0.6,"d":"0.60 m"},{"$f":"IF(AND($D$12>0.6,$D$12<0.7),$D$12,0)","v":{"v":0,"d":"0.00 m"}},{"v":0.7,"d":"0.70 m"},{"$f":"IF(AND($D$12>0.7,$D$12<0.8),$D$12,0)","v":{"v":0.73,"d":"0.73 m"}},{"v":0.8,"d":"0.80 m"},{"$f":"IF(AND($D$12>0.8,$D$12<0.9),$D$12,0)","v":{"v":0,"d":"0.00 m"}},{"v":0.9,"d":"0.90 m"},{"$f":"IF(AND($D$12>0.9,$D$12<1),$D$12,0)","v":{"v":0,"d":"0.00 m"}},{"v":1,"d":"1.00 m"},{"$f":"IF(AND($D$12>1,$D$12<1.1),$D$12,0)","v":{"v":0,"d":"0.00 m"}},{"v":1.1,"d":"1.10 m"}]
[null,"BV:",null,{"$f":"'Ermittlung Schneelast'!D7","v":{"v":0,"d":"0.00"}},null,null,"1a) Verglasung",{"$f":"VLOOKUP($D$5,Daten!$A$38:$D$43,2)","v":{"v":1,"d":"1.000"}},null,{"v":0.52,"d":"0.52 kN/qm"},1.13,null,"577105",{"v":5.96,"d":"5.96 m"},{"$f":"N2-(N2-P2)*($O$1-$N$1)/($P$1-$N$1)","v":{"v":7.610000000000001,"d":"7.61 m"}},{"v":5.63,"d":"5.63 m"},{"$f":"P2-(P2-R2)*($Q$1-$P$1)/($R$1-$P$1)","v":{"v":7.310000000000002,"d":"7.31 m"}},{"v":5.35,"d":"5.35 m"},{"$f":"R2-(R2-T2)*($S$1-$R$1)/($T$1-$R$1)","v":{"v":5.281,"d":"5.28 m"}},{"v":5.12,"d":"5.12 m"},{"$f":"T2-(T2-V2)*($U$1-$T$1)/($V$1-$T$1)","v":{"v":6.640000000000004,"d":"6.64 m"}},{"v":4.93,"d":"4.93 m"},{"$f":"V2-(V2-X2)*($W$1-$V$1)/($X$1-$V$1)","v":{"v":6.459999999999999,"d":"6.46 m"}},{"v":4.76,"d":"4.76 m"},{"$f":"X2-(X2-Z2)*($Y$1-$X$1)/($Z$1-$X$1)","v":{"v":6.259999999999993,"d":"6.26 m"}},{"v":4.61,"d":"4.61 m"},{"$nulls":7},"1b) Verglasung",{"$f":"VLOOKUP($D$5,Daten!$A$38:$D$43,3)","v":{"v":1,"d":"1.000"}},null,{"v":0.52,"d":"0.52 kN/qm"},{"v":1.2,"d":"1.20"},null,"577105",{"v":7.75,"d":"7.75 m"},{"$f":"AO2-(AO2-AQ2)*($O$1-$N$1)/($P$1-$N$1)","v":{"v":10.95,"d":"10.95 m"}},{"v":7.11,"d":"7.11 m"},{"$f":"AQ2-(AQ2-AS2)*($Q$1-$P$1)/($R$1-$P$1)","v":{"v":10.170000000000005,"d":"10.17 m"}},{"v":6.6,"d":"6.60 m"},{"$f":"AS2-(AS2-AU2)*($S$1-$R$1)/($T$1-$R$1)","v":{"v":6.477,"d":"6.48 m"}},{"v":6.19,"d":"6.19 m"},{"$f":"AU2-(AU2-AW2)*($U$1-$T$1)/($V$1-$T$1)","v":{"v":8.910000000000007,"d":"8.91 m"}},{"v":5.85,"d":"5.85 m"},{"$f":"AW2-(AW2-AY2)*($W$1-$V$1)/($X$1-$V$1)","v":{"v":8.46,"d":"8.46 m"}},{"v":5.56,"d":"5.56 m"},{"$f":"AY2-(AY2-BA2)*($Y$1-$X$1)/($Z$1-$X$1)","v":{"v":8.159999999999995,"d":"8.16 m"}},{"v":5.3,"d":"5.30 m"},{"$nulls":7},"1c) Verglasung",{"$f":"VLOOKUP($D$5,Daten!$A$38:$D$43,4)","v":{"v":1,"d":"1.000"}},null,{"v":1.196,"d":"1.196 kN/qm"},1.08,null,"577105",{"v":8.28,"d":"8.28 m"},{"$f":"BP2-(BP2-BR2)*($O$1-$N$1)/($P$1-$N$1)","v":{"v":11.729999999999997,"d":"11.73 m"}},{"v":7.59,"d":"7.59 m"},{"$f":"BR2-(BR2-BT2)*($Q$1-$P$1)/($R$1-$P$1)","v":{"v":10.83,"d":"10.83 m"}},{"v":7.05,"d":"7.05 m"},{"$f":"BT2-(BT2-BV2)*($S$1-$R$1)/($T$1-$R$1)","v":{"v":6.918,"d":"6.92 m"}},{"v":6.61,"d":"6.61 m"},{"$f":"BV2-(BV2-BX2)*($U$1-$T$1)/($V$1-$T$1)","v":{"v":9.570000000000002,"d":"9.57 m"}},{"v":6.24,"d":"6.24 m"},{"$f":"BX2-(BX2-BZ2)*($W$1-$V$1)/($X$1-$V$1)","v":{"v":9.030000000000005,"d":"9.03 m"}},{"v":5.93,"d":"5.93 m"},{"$f":"BZ2-(BZ2-CB2)*($Y$1-$X$1)/($Z$1-$X$1)","v":{"v":8.629999999999994,"d":"8.63 m"}},{"v":5.66,"d":"5.66 m"}]
[{"$nulls":6},"1a) Schnee sDA ",{"$f":"VLOOKUP($D$6,J2:K14,2)","v":0.982},null,{"$f":"IF(AND($D$6>J2,$D$6<J4),$D$6,\"nicht interpolieren\")","v":"nicht interpolieren"},{"$f":"K2-(K2-K4)*(J3-J2)/(J4-J2)","v":{"$error":"#VALUE!"}},null,"577105+120*50*3",{"v":7.03,"d":"7.03 m"},{"v":8.830000000000002,"d":"8.83 m"},{"v":6.67,"d":"6.67 m"},{"v":8.41,"d":"8.41 m"},{"v":6.38,"d":"6.38 m"},{"v":6.305,"d":"6.31 m"},{"v":6.13,"d":"6.13 m"},{"v":7.889999999999999,"d":"7.89 m"},{"v":5.91,"d":"5.91 m"},{"v":7.620000000000004,"d":"7.62 m"},{"v":5.72,"d":"5.72 m"},{"v":7.32,"d":"7.32 m"},{"v":5.56,"d":"5.56 m"},{"$nulls":7},"1b) Schnee sDA ",{"$f":"VLOOKUP($D$6,AK2:AL14,2)","v":0.972},null,{"$f":"IF(AND($D$6>AK2,$D$6<AK4),$D$6,\"nicht interpolieren\")","v":"nicht interpolieren"},{"$f":"AL2-(AL2-AL4)*(AK3-AK2)/(AK4-AK2)","v":{"$error":"#VALUE!"}},null,"577105+120*50*3",{"v":9.73,"d":"9.73 m"},{"v":13.48,"d":"13.48 m"},{"v":8.98,"d":"8.98 m"},{"v":12.52,"d":"12.52 m"},{"v":8.39,"d":"8.39 m"},{"v":8.243,"d":"8.24 m"},{"v":7.9,"d":"7.90 m"},{"v":11.260000000000002,"d":"11.26 m"},{"v":7.48,"d":"7.48 m"},{"v":10.630000000000006,"d":"10.63 m"},{"v":7.13,"d":"7.13 m"},{"v":10.229999999999993,"d":"10.23 m"},{"v":6.82,"d":"6.82 m"},{"$nulls":7},"1c) Schnee sA ",{"$f":"IF('Ermittlung Schneelast'!D17=\"nein\",10000,VLOOKUP(D7,BL2:BM12,2))","v":{"v":10000,"d":"10000.000"}},null,{"$f":"IF(AND($D$7>BL2,$D$7<BL4),$D$7,\"nicht interpolieren\")","v":"nicht interpolieren"},{"$f":"BM2-(BM2-BM4)*(BL3-BL2)/(BL4-BL2)","v":{"$error":"#VALUE!"}},null,"577105+120*50*3",{"v":10.47,"d":"10.47 m"},{"v":14.570000000000004,"d":"14.57 m"},{"v":9.65,"d":"9.65 m"},{"v":13.550000000000002,"d":"13.55 m"},{"v":9,"d":"9.00 m"},{"v":8.838000000000001,"d":"8.84 m"},{"v":8.46,"d":"8.46 m"},{"v":12.06000000000001,"d":"12.06 m"},{"v":8.01,"d":"8.01 m"},{"v":11.43,"d":"11.43 m"},{"v":7.63,"d":"7.63 m"},{"v":11.029999999999996,"d":"11.03 m"},{"v":7.29,"d":"7.29 m"}]
[null,"Bemessungstabelle: Pos. 1.1 Mittelträger isoliert",{"$nulls":4},"1a) Wind",{"$f":"VLOOKUP($D$8,Daten!$A$50:$D$58,4)","v":{"v":1,"d":"1.000"}},null,{"v":0.75,"d":"0.75 kN/qm"},1.06,null,"577105+120*50*5",{"v":7.51,"d":"7.51 m"},{"v":9.309999999999997,"d":"9.31 m"},{"v":7.15,"d":"7.15 m"},{"v":9.010000000000003,"d":"9.01 m"},{"v":6.84,"d":"6.84 m"},{"v":6.765,"d":"6.77 m"},{"v":6.59,"d":"6.59 m"},{"v":8.429999999999996,"d":"8.43 m"},{"v":6.36,"d":"6.36 m"},{"v":8.070000000000004,"d":"8.07 m"},{"v":6.17,"d":"6.17 m"},{"v":7.969999999999995,"d":"7.97 m"},{"v":5.99,"d":"5.99 m"},{"$nulls":7},"1b) Wind",{"$f":"VLOOKUP($D$8,Daten!$A$50:$D$58,4)","v":{"v":1,"d":"1.000"}},null,{"v":0.75,"d":"0.75 kN/qm"},1.09,null,"577105+120*50*5",{"v":10.78,"d":"10.78 m"},{"v":14.729999999999997,"d":"14.73 m"},{"v":9.99,"d":"9.99 m"},{"v":13.770000000000005,"d":"13.77 m"},{"v":9.36,"d":"9.36 m"},{"v":9.201,"d":"9.20 m"},{"v":8.83,"d":"8.83 m"},{"v":12.429999999999996,"d":"12.43 m"},{"v":8.38,"d":"8.38 m"},{"v":11.800000000000008,"d":"11.80 m"},{"v":8,"d":"8.00 m"},{"v":11.399999999999995,"d":"11.40 m"},{"v":7.66,"d":"7.66 m"},{"$nulls":7},"1c) Wind",{"v":1,"d":"1.000"},null,{"v":1.5,"d":"1.50 kN/qm"},{"v":1,"d":"1.00"},null,"577105+120*50*5",{"v":11.64,"d":"11.64 m"},{"v":15.990000000000006,"d":"15.99 m"},{"v":10.77,"d":"10.77 m"},{"v":14.969999999999995,"d":"14.97 m"},{"v":10.07,"d":"10.07 m"},{"v":9.896,"d":"9.90 m"},{"v":9.49,"d":"9.49 m"},{"v":13.410000000000004,"d":"13.41 m"},{"v":9,"d":"9.00 m"},{"v":12.780000000000001,"d":"12.78 m"},{"v":8.58,"d":"8.58 m"},{"v":12.279999999999989,"d":"12.28 m"},{"v":8.21,"d":"8.21 m"}]
[null,"Dachlast gDa","=","ISO-VSG (6+8), 14mm Glasdicke",null,null,"1a) Dachneigung",{"$f":"VLOOKUP($D$9,J17:K22,2)","v":{"v":1,"d":"1.000"}},null,{"$f":"IF(AND($D$6>J4,$D$6<J6),$D$6,\"nicht interpolieren\")","v":"nicht interpolieren"},{"$f":"K4-(K4-K6)*(J5-J4)/(J6-J4)","v":{"$error":"#VALUE!"}},null,"577105+I120",{"v":7.82,"d":"7.82 m"},{"v":9.770000000000003,"d":"9.77 m"},{"v":7.43,"d":"7.43 m"},{"v":9.349999999999996,"d":"9.35 m"},{"v":7.11,"d":"7.11 m"},{"v":7.029,"d":"7.03 m"},{"v":6.84,"d":"6.84 m"},{"v":8.679999999999996,"d":"8.68 m"},{"v":6.61,"d":"6.61 m"},{"v":8.5,"d":"8.50 m"},{"v":6.4,"d":"6.40 m"},{"v":8.200000000000005,"d":"8.20 m"},{"v":6.22,"d":"6.22 m"},{"$nulls":7},"1b) Dachneigung",{"$f":"VLOOKUP($D$9,AK17:AL22,2)","v":{"v":1,"d":"1.000"}},null,{"$f":"IF(AND($D$6>AK4,$D$6<AK6),$D$6,\"nicht interpolieren\")","v":"nicht interpolieren"},{"$f":"AL4-(AL4-AL6)*(AK5-AK4)/(AK6-AK4)","v":{"$error":"#VALUE!"}},null,"577105+I120",{"v":11.45,"d":"11.45 m"},{"v":15.7,"d":"15.70 m"},{"v":10.6,"d":"10.60 m"},{"v":14.739999999999998,"d":"14.74 m"},{"v":9.91,"d":"9.91 m"},{"v":9.742,"d":"9.74 m"},{"v":9.35,"d":"9.35 m"},{"v":13.190000000000005,"d":"13.19 m"},{"v":8.87,"d":"8.87 m"},{"v":12.559999999999985,"d":"12.56 m"},{"v":8.46,"d":"8.46 m"},{"v":12.06000000000001,"d":"12.06 m"},{"v":8.1,"d":"8.10 m"},{"$nulls":7},"1c) Dachneigung",{"$f":"VLOOKUP($D$9,BL15:BM20,2)","v":{"v":1,"d":"1.000"}},null,{"$f":"IF(AND($D$7>BL4,$D$7<BL6),$D$7,\"nicht interpolieren\")","v":"nicht interpolieren"},{"$f":"BM4-(BM4-BM6)*(BL5-BL4)/(BL6-BL4)","v":{"$error":"#VALUE!"}},null,"577105+I120",{"v":12.35,"d":"12.35 m"},{"v":17.049999999999997,"d":"17.05 m"},{"v":11.41,"d":"11.41 m"},{"v":15.91,"d":"15.91 m"},{"v":10.66,"d":"10.66 m"},{"v":10.474,"d":"10.47 m"},{"v":10.04,"d":"10.04 m"},{"v":14.199999999999998,"d":"14.20 m"},{"v":9.52,"d":"9.52 m"},{"v":13.569999999999993,"d":"13.57 m"},{"v":9.07,"d":"9.07 m"},{"v":13.07,"d":"13.07 m"},{"v":8.67,"d":"8.67 m"}]
[null,"normale Schneelast sDa","=",{"$f":"'Ermittlung Schneelast'!D53","v":{"v":1.1,"d":"1.100 kN/qm"}},null,null,"zul. Durchbiegung",{"$f":"VLOOKUP($D$13,Daten!$A$44:$B$47,2)","v":{"v":1,"d":"1.00"}},null,{"v":1,"d":"1.00 kN/qm"},{"v":1,"d":"1.00"},null,"577333",{"v":2.54,"d":"2.54 m"},{"v":3.3899999999999997,"d":"3.39 m"},{"v":2.37,"d":"2.37 m"},{"v":3.210000000000001,"d":"3.21 m"},{"v":2.23,"d":"2.23 m"},{"v":2.2,"d":"2.20 m"},{"v":2.13,"d":"2.13 m"},{"v":2.8499999999999988,"d":"2.85 m"},{"v":2.04,"d":"2.04 m"},{"v":2.7600000000000007,"d":"2.76 m"},{"v":1.96,"d":"1.96 m"},{"v":2.76,"d":"2.76 m"},{"v":1.88,"d":"1.88 m"},{"$nulls":7},"zul. Durchbiegung",{"$f":"VLOOKUP($D$13,Daten!$A$44:$B$47,2)","v":1},null,{"v":1,"d":"1.00 kN/qm"},{"v":1,"d":"1.00"},null,"577333",{"v":3.47,"d":"3.47 m"},{"v":4.920000000000001,"d":"4.92 m"},{"v":3.18,"d":"3.18 m"},{"v":4.620000000000002,"d":"4.62 m"},{"v":2.94,"d":"2.94 m"},{"v":2.88,"d":"2.88 m"},{"v":2.74,"d":"2.74 m"},{"v":4.020000000000001,"d":"4.02 m"},{"v":2.58,"d":"2.58 m"},{"v":3.8400000000000016,"d":"3.84 m"},{"v":2.44,"d":"2.44 m"},{"v":3.7399999999999975,"d":"3.74 m"},{"v":2.31,"d":"2.31 m"},{"$nulls":7},"zul. Durchbiegung",{"$f":"VLOOKUP($D$13,Daten!$A$44:$B$47,2)","v":1},null,{"v":2,"d":"2.00 kN/qm"},0.89,null,"577333",{"v":3.7,"d":"3.70 m"},{"v":5.3000000000000025,"d":"5.30 m"},{"v":3.38,"d":"3.38 m"},{"v":4.8199999999999985,"d":"4.82 m"},{"v":3.14,"d":"3.14 m"},{"v":3.08,"d":"3.08 m"},{"v":2.94,"d":"2.94 m"},{"v":4.380000000000002,"d":"4.38 m"},{"v":2.76,"d":"2.76 m"},{"v":4.109999999999999,"d":"4.11 m"},{"v":2.61,"d":"2.61 m"},{"v":3.9099999999999975,"d":"3.91 m"},{"v":2.48,"d":"2.48 m"}]
[null,"außergewöhnliche Schneelast sa","=",{"$f":"'Ermittlung Schneelast'!D54","v":"nur erforderlich für Norddeutsches Tiefland"},{"$nulls":5},{"$f":"IF(AND($D$6>J6,$D$6<J8),$D$6,\"nicht interpolieren\")","v":{"v":1.1,"d":"1.10 kN/qm"}},{"$f":"K6-(K6-K8)*(J7-J6)/(J8-J6)","v":{"v":0.982,"d":"0.98"}},null,"577333+30*30*2",{"v":2.6,"d":"2.60 m"},{"v":3.3499999999999996,"d":"3.35 m"},{"v":2.45,"d":"2.45 m"},{"v":3.170000000000001,"d":"3.17 m"},{"v":2.33,"d":"2.33 m"},{"v":2.3,"d":"2.30 m"},{"v":2.23,"d":"2.23 m"},{"v":2.8700000000000006,"d":"2.87 m"},{"v":2.15,"d":"2.15 m"},{"v":2.7799999999999985,"d":"2.78 m"},{"v":2.08,"d":"2.08 m"},{"v":2.780000000000002,"d":"2.78 m"},{"v":2.01,"d":"2.01 m"},{"$nulls":10},{"$f":"IF(AND($D$6>AK6,$D$6<AK8),$D$6,\"nicht interpolieren\")","v":{"v":1.1,"d":"1.10 kN/qm"}},{"$f":"AL6-(AL6-AL8)*(AK7-AK6)/(AK8-AK6)","v":{"v":0.972,"d":"0.97"}},null,"577333+30*30*2",{"v":3.64,"d":"3.64 m"},{"v":5.140000000000002,"d":"5.14 m"},{"v":3.34,"d":"3.34 m"},{"v":4.7799999999999985,"d":"4.78 m"},{"v":3.1,"d":"3.10 m"},{"v":3.04,"d":"3.04 m"},{"v":2.9,"d":"2.90 m"},{"v":4.179999999999998,"d":"4.18 m"},{"v":2.74,"d":"2.74 m"},{"v":3.9100000000000037,"d":"3.91 m"},{"v":2.61,"d":"2.61 m"},{"v":3.809999999999995,"d":"3.81 m"},{"v":2.49,"d":"2.49 m"},{"$nulls":10},{"$f":"IF(AND($D$7>BL6,$D$7<BL8),$D$7,\"nicht interpolieren\")","v":"nicht interpolieren"},{"$f":"BM6-(BM6-BM8)*(BL7-BL6)/(BL8-BL6)","v":{"$error":"#VALUE!"}},null,"577333+30*30*2",{"v":3.89,"d":"3.89 m"},{"v":5.540000000000001,"d":"5.54 m"},{"v":3.56,"d":"3.56 m"},{"v":5.0600000000000005,"d":"5.06 m"},{"v":3.31,"d":"3.31 m"},{"v":3.247,"d":"3.25 m"},{"v":3.1,"d":"3.10 m"},{"v":4.46,"d":"4.46 m"},{"v":2.93,"d":"2.93 m"},{"v":4.280000000000004,"d":"4.28 m"},{"v":2.78,"d":"2.78 m"},{"v":4.079999999999997,"d":"4.08 m"},{"v":2.65,"d":"2.65 m"}]
[null,"Windzone WZ","=",{"$f":"'Ermittlung Schneelast'!D11:F11","v":"1, Binnenland"},{"$nulls":5},{"v":1.5,"d":"1.50 kN/qm"},0.91,null,"577335",{"v":3.69,"d":"3.69 m"},{"v":4.789999999999999,"d":"4.79 m"},{"v":3.47,"d":"3.47 m"},{"v":4.550000000000002,"d":"4.55 m"},{"v":3.29,"d":"3.29 m"},{"v":3.245,"d":"3.25 m"},{"v":3.14,"d":"3.14 m"},{"v":4.180000000000003,"d":"4.18 m"},{"v":3.01,"d":"3.01 m"},{"v":3.999999999999999,"d":"4.00 m"},{"v":2.9,"d":"2.90 m"},{"v":3.9,"d":"3.90 m"},{"v":2.8,"d":"2.80 m"},{"$nulls":10},{"v":1.5,"d":"1.50 kN/qm"},0.86,null,"577335",{"v":4.76,"d":"4.76 m"},{"v":6.759999999999998,"d":"6.76 m"},{"v":4.36,"d":"4.36 m"},{"v":6.340000000000002,"d":"6.34 m"},{"v":4.03,"d":"4.03 m"},{"v":3.9490000000000003,"d":"3.95 m"},{"v":3.76,"d":"3.76 m"},{"v":5.519999999999999,"d":"5.52 m"},{"v":3.54,"d":"3.54 m"},{"v":5.160000000000002,"d":"5.16 m"},{"v":3.36,"d":"3.36 m"},{"v":4.9599999999999955,"d":"4.96 m"},{"v":3.2,"d":"3.20 m"},{"$nulls":10},{"v":2.5,"d":"2.50 kN/qm"},0.81,null,"577335",{"v":5.08,"d":"5.08 m"},{"v":7.229999999999999,"d":"7.23 m"},{"v":4.65,"d":"4.65 m"},{"v":6.7500000000000036,"d":"6.75 m"},{"v":4.3,"d":"4.30 m"},{"v":4.215999999999999,"d":"4.22 m"},{"v":4.02,"d":"4.02 m"},{"v":5.859999999999996,"d":"5.86 m"},{"v":3.79,"d":"3.79 m"},{"v":5.590000000000002,"d":"5.59 m"},{"v":3.59,"d":"3.59 m"},{"v":5.389999999999995,"d":"5.39 m"},{"v":3.41,"d":"3.41 m"}]
[null,"Dachneigung WG","=",{"$f":"'Ermittlung Schneelast'!D18","v":{"v":10,"d":"10.0°"}},{"$nulls":5},{"$f":"IF(AND(D$6>J8,$D$6<J10),$D$6,\"nicht interpolieren\")","v":"nicht interpolieren"},{"$f":"K8-(K8-K10)*(J9-J8)/(J10-J8)","v":{"$error":"#VALUE!"}},null,"577335+70*30*3",{"v":4.27,"d":"4.27 m"},{"v":5.419999999999997,"d":"5.42 m"},{"v":4.04,"d":"4.04 m"},{"v":5.18,"d":"5.18 m"},{"v":3.85,"d":"3.85 m"},{"v":3.805,"d":"3.81 m"},{"v":3.7,"d":"3.70 m"},{"v":4.820000000000001,"d":"4.82 m"},{"v":3.56,"d":"3.56 m"},{"v":4.6400000000000015,"d":"4.64 m"},{"v":3.44,"d":"3.44 m"},{"v":4.4399999999999995,"d":"4.44 m"},{"v":3.34,"d":"3.34 m"},{"$nulls":10},{"$f":"IF(AND($D$6>AK8,$D$6<AK10),$D$6,\"nicht interpolieren\")","v":"nicht interpolieren"},{"$f":"AL8-(AL8-AL10)*(AK9-AK8)/(AK10-AK8)","v":{"$error":"#VALUE!"}},null,"577335+70*30*3",{"v":5.9,"d":"5.90 m"},{"v":8.250000000000004,"d":"8.25 m"},{"v":5.43,"d":"5.43 m"},{"v":7.709999999999999,"d":"7.71 m"},{"v":5.05,"d":"5.05 m"},{"v":4.957,"d":"4.96 m"},{"v":4.74,"d":"4.74 m"},{"v":6.819999999999999,"d":"6.82 m"},{"v":4.48,"d":"4.48 m"},{"v":6.460000000000007,"d":"6.46 m"},{"v":4.26,"d":"4.26 m"},{"v":6.159999999999993,"d":"6.16 m"},{"v":4.07,"d":"4.07 m"},{"$nulls":10},{"$f":"IF(AND($D$7>BL8,$D$7<BL10),$D$7,\"nicht interpolieren\")","v":"nicht interpolieren"},{"$f":"BM8-(BM8-BM10)*(BL9-BL8)/(BL10-BL8)","v":{"$error":"#VALUE!"}},null,"577335+70*30*3",{"v":6.32,"d":"6.32 m"},{"v":8.870000000000005,"d":"8.87 m"},{"v":5.81,"d":"5.81 m"},{"v":8.269999999999996,"d":"8.27 m"},{"v":5.4,"d":"5.40 m"},{"v":5.301,"d":"5.30 m"},{"v":5.07,"d":"5.07 m"},{"v":7.310000000000002,"d":"7.31 m"},{"v":4.79,"d":"4.79 m"},{"v":6.950000000000003,"d":"6.95 m"},{"v":4.55,"d":"4.55 m"},{"v":6.55,"d":"6.55 m"},{"v":4.35,"d":"4.35 m"}]
[null,"Tiefe WG b2","=",{"$f":"'Ermittlung Schneelast'!_b2","v":{"v":3.5,"d":"3.50 m"}},{"$nulls":5},{"v":2,"d":"2.00 kN/qm"},0.84,null,"577339",{"v":4.69,"d":"4.69 m"},{"v":6.040000000000003,"d":"6.04 m"},{"v":4.42,"d":"4.42 m"},{"v":5.739999999999998,"d":"5.74 m"},{"v":4.2,"d":"4.20 m"},{"v":4.143,"d":"4.14 m"},{"v":4.01,"d":"4.01 m"},{"v":5.289999999999997,"d":"5.29 m"},{"v":3.85,"d":"3.85 m"},{"v":5.02,"d":"5.02 m"},{"v":3.72,"d":"3.72 m"},{"v":4.92,"d":"4.92 m"},{"v":3.6,"d":"3.60 m"},{"$nulls":10},{"v":2,"d":"2.00 kN/qm"},0.77,null,"577339",{"v":7.02,"d":"7.02 m"},{"v":9.919999999999996,"d":"9.92 m"},{"v":6.44,"d":"6.44 m"},{"v":9.200000000000001,"d":"9.20 m"},{"v":5.98,"d":"5.98 m"},{"v":5.869000000000001,"d":"5.87 m"},{"v":5.61,"d":"5.61 m"},{"v":8.090000000000005,"d":"8.09 m"},{"v":5.3,"d":"5.30 m"},{"v":7.639999999999999,"d":"7.64 m"},{"v":5.04,"d":"5.04 m"},{"v":7.4399999999999995,"d":"7.44 m"},{"v":4.8,"d":"4.80 m"},{"$nulls":10},{"v":3,"d":"3.00 kN/qm"},0.75,null,"577339",{"v":7.51,"d":"7.51 m"},{"v":10.66,"d":"10.66 m"},{"v":6.88,"d":"6.88 m"},{"v":9.820000000000002,"d":"9.82 m"},{"v":6.39,"d":"6.39 m"},{"v":6.27,"d":"6.27 m"},{"v":5.99,"d":"5.99 m"},{"v":8.71,"d":"8.71 m"},{"v":5.65,"d":"5.65 m"},{"v":8.170000000000003,"d":"8.17 m"},{"v":5.37,"d":"5.37 m"},{"v":7.77,"d":"7.77 m"},{"v":5.13,"d":"5.13 m"}]
[null,"Träger","=","577339",{"$nulls":5},{"$f":"IF(AND($D$6>J10,$D$6<J12),$D$6,\"nicht interpolieren\")","v":"nicht interpolieren"},{"$f":"K10-(K10-K12)*(J11-J10)/(J12-J10)","v":{"$error":"#VALUE!"}},null,"577339+80*60*3",{"v":5.43,"d":"5.43 m"},{"v":6.8299999999999965,"d":"6.83 m"},{"v":5.15,"d":"5.15 m"},{"v":6.530000000000003,"d":"6.53 m"},{"v":4.92,"d":"4.92 m"},{"v":4.859999999999999,"d":"4.86 m"},{"v":4.72,"d":"4.72 m"},{"v":6.08,"d":"6.08 m"},{"v":4.55,"d":"4.55 m"},{"v":5.809999999999997,"d":"5.81 m"},{"v":4.41,"d":"4.41 m"},{"v":5.709999999999998,"d":"5.71 m"},{"v":4.28,"d":"4.28 m"},{"$nulls":10},{"$f":"IF(AND($D$6>AK10,$D$6<AK12),$D$6,\"nicht interpolieren\")","v":"nicht interpolieren"},{"$f":"AL10-(AL10-AL12)*(AK11-AK10)/(AK12-AK10)","v":{"$error":"#VALUE!"}},null,"577339+80*60*3",{"v":8.09,"d":"8.09 m"},{"v":11.190000000000001,"d":"11.19 m"},{"v":7.47,"d":"7.47 m"},{"v":10.47,"d":"10.47 m"},{"v":6.97,"d":"6.97 m"},{"v":6.843999999999999,"d":"6.84 m"},{"v":6.55,"d":"6.55 m"},{"v":9.27,"d":"9.27 m"},{"v":6.21,"d":"6.21 m"},{"v":8.91,"d":"8.91 m"},{"v":5.91,"d":"5.91 m"},{"v":8.509999999999996,"d":"8.51 m"},{"v":5.65,"d":"5.65 m"},{"$nulls":10},{"$f":"IF(AND($D$7>BL10,$D$7<BL12),$D$7,\"nicht interpolieren\")","v":"nicht interpolieren"},{"$f":"BM10-(BM10-BM12)*(BL11-BL10)/(BL12-BL10)","v":{"$error":"#VALUE!"}},null,"577339+80*60*3",{"v":8.7,"d":"8.70 m"},{"v":12.149999999999999,"d":"12.15 m"},{"v":8.01,"d":"8.01 m"},{"v":11.25,"d":"11.25 m"},{"v":7.47,"d":"7.47 m"},{"v":7.335,"d":"7.34 m"},{"v":7.02,"d":"7.02 m"},{"v":9.979999999999993,"d":"9.98 m"},{"v":6.65,"d":"6.65 m"},{"v":9.620000000000001,"d":"9.62 m"},{"v":6.32,"d":"6.32 m"},{"v":9.020000000000003,"d":"9.02 m"},{"v":6.05,"d":"6.05 m"}]
[null,"Achsabstand","=",{"v":0.73,"d":"0.73  m"},{"$f":"IF(OR(D12<0.5,D12>1.1),\"Achtung: Trägerabstand muss zwischen 0,50 m und 1,10 m betragen!\",\"\")","v":""},{"$nulls":4},{"v":2.5,"d":"2.50 kN/qm"},0.79,null,"577339+80*60*5",{"v":5.74,"d":"5.74 m"},{"v":7.19,"d":"7.19 m"},{"v":5.45,"d":"5.45 m"},{"v":6.830000000000004,"d":"6.83 m"},{"v":5.22,"d":"5.22 m"},{"v":5.16,"d":"5.16 m"},{"v":5.02,"d":"5.02 m"},{"v":6.459999999999997,"d":"6.46 m"},{"v":4.84,"d":"4.84 m"},{"v":6.189999999999996,"d":"6.19 m"},{"v":4.69,"d":"4.69 m"},{"v":5.990000000000007,"d":"5.99 m"},{"v":4.56,"d":"4.56 m"},{"$nulls":10},{"v":2.5,"d":"2.50 kN/qm"},{"v":0.7,"d":"0.70"},null,"577339+80*60*5",{"v":8.82,"d":"8.82 m"},{"v":12.120000000000001,"d":"12.12 m"},{"v":8.16,"d":"8.16 m"},{"v":11.340000000000002,"d":"11.34 m"},{"v":7.63,"d":"7.63 m"},{"v":7.498,"d":"7.50 m"},{"v":7.19,"d":"7.19 m"},{"v":10.150000000000002,"d":"10.15 m"},{"v":6.82,"d":"6.82 m"},{"v":9.700000000000003,"d":"9.70 m"},{"v":6.5,"d":"6.50 m"},{"v":9.199999999999994,"d":"9.20 m"},{"v":6.23,"d":"6.23 m"},{"$nulls":10},{"v":4,"d":"4.00 kN/qm"},0.66,null,"577339+80*60*5",{"v":9.51,"d":"9.51 m"},{"v":13.160000000000004,"d":"13.16 m"},{"v":8.78,"d":"8.78 m"},{"v":12.26,"d":"12.26 m"},{"v":8.2,"d":"8.20 m"},{"v":8.056,"d":"8.06 m"},{"v":7.72,"d":"7.72 m"},{"v":10.919999999999996,"d":"10.92 m"},{"v":7.32,"d":"7.32 m"},{"v":10.470000000000006,"d":"10.47 m"},{"v":6.97,"d":"6.97 m"},{"v":9.969999999999995,"d":"9.97 m"},{"v":6.67,"d":"6.67 m"}]
[null,"zul. Durchbiegung","=","l/200","Info",{"$nulls":4},{"$f":"IF(AND($D$6>J12,$D$6<J14),$D$6,\"nicht interpolieren\")","v":"nicht interpolieren"},{"$f":"K12-(K12-K14)*(J13-J12)/(J14-J12)","v":{"$error":"#VALUE!"}},null,"579500",{"v":5.78,"d":"5.78 m"},{"$f":"N13-(N13-P13)*($O$1-$N$1)/($P$1-$N$1)","v":{"v":7.630000000000001,"d":"7.63 m"}},{"v":5.41,"d":"5.41 m"},{"$f":"P13-(P13-R13)*($Q$1-$P$1)/($R$1-$P$1)","v":{"v":7.15,"d":"7.15 m"}},{"v":5.12,"d":"5.12 m"},{"$f":"R13-(R13-T13)*($S$1-$R$1)/($T$1-$R$1)","v":{"v":5.045,"d":"5.05 m"}},{"v":4.87,"d":"4.87 m"},{"$f":"T13-(T13-V13)*($U$1-$T$1)/($V$1-$T$1)","v":{"v":6.470000000000002,"d":"6.47 m"}},{"v":4.67,"d":"4.67 m"},{"$f":"V13-(V13-X13)*($W$1-$V$1)/($X$1-$V$1)","v":{"v":6.199999999999999,"d":"6.20 m"}},{"v":4.5,"d":"4.50 m"},{"$f":"X13-(X13-Z13)*($Y$1-$X$1)/($Z$1-$X$1)","v":{"v":6.1,"d":"6.10 m"}},{"v":4.34,"d":"4.34 m"},{"$nulls":10},{"$f":"IF(AND($D$6>AK12,$D$6<AK14),$D$6,\"nicht interpolieren\")","v":"nicht interpolieren"},{"$f":"AL12-(AL12-AL14)*(AK13-AK12)/(AK14-AK12)","v":{"$error":"#VALUE!"}},null,"579500",{"v":8.89,"d":"8.89 m"},{"$f":"AO13-(AO13-AQ13)*($O$1-$N$1)/($P$1-$N$1)","v":{"v":12.540000000000003,"d":"12.54 m"}},{"v":8.16,"d":"8.16 m"},{"$f":"AQ13-(AQ13-AS13)*($Q$1-$P$1)/($R$1-$P$1)","v":{"v":11.580000000000002,"d":"11.58 m"}},{"v":7.59,"d":"7.59 m"},{"$f":"AS13-(AS13-AU13)*($S$1-$R$1)/($T$1-$R$1)","v":{"v":7.449,"d":"7.45 m"}},{"v":7.12,"d":"7.12 m"},{"$f":"AU13-(AU13-AW13)*($U$1-$T$1)/($V$1-$T$1)","v":{"v":10.320000000000004,"d":"10.32 m"}},{"v":6.72,"d":"6.72 m"},{"$f":"AW13-(AW13-AY13)*($W$1-$V$1)/($X$1-$V$1)","v":{"v":9.690000000000001,"d":"9.69 m"}},{"v":6.39,"d":"6.39 m"},{"$f":"AY13-(AY13-BA13)*($Y$1-$X$1)/($Z$1-$X$1)","v":{"v":9.289999999999997,"d":"9.29 m"}},{"v":6.1,"d":"6.10 m"},{"$nulls":13},"579500",{"v":9.51,"d":"9.51 m"},{"$f":"BP13-(BP13-BR13)*($O$1-$N$1)/($P$1-$N$1)","v":{"v":13.459999999999997,"d":"13.46 m"}},{"v":8.72,"d":"8.72 m"},{"$f":"BR13-(BR13-BT13)*($Q$1-$P$1)/($R$1-$P$1)","v":{"v":12.440000000000008,"d":"12.44 m"}},{"v":8.1,"d":"8.10 m"},{"$f":"BT13-(BT13-BV13)*($S$1-$R$1)/($T$1-$R$1)","v":{"v":7.949999999999999,"d":"7.95 m"}},{"v":7.6,"d":"7.60 m"},{"$f":"BV13-(BV13-BX13)*($U$1-$T$1)/($V$1-$T$1)","v":{"v":10.96,"d":"10.96 m"}},{"v":7.18,"d":"7.18 m"},{"$f":"BX13-(BX13-BZ13)*($W$1-$V$1)/($X$1-$V$1)","v":{"v":10.419999999999995,"d":"10.42 m"}},{"v":6.82,"d":"6.82 m"},{"$f":"BZ13-(BZ13-CB13)*($Y$1-$X$1)/($Z$1-$X$1)","v":{"v":9.920000000000002,"d":"9.92 m"}},{"v":6.51,"d":"6.51 m"}]
[null,{"$f":"D10","v":{"v":3.5,"d":"3.50 m"}},{"$f":"IF(B14<D14,\"<\",\">\")","v":"<"},{"$f":"MIN(H19,AI19,BJ19)","v":{"v":4.068426,"d":"4.07 m"}},{"$nulls":5},{"v":3,"d":"3.00 kN/qm"},0.75,null,"579500+100*50*4",{"v":6.62,"d":"6.62 m"},{"$f":"N14-(N14-P14)*($O$1-$N$1)/($P$1-$N$1)","v":{"v":8.270000000000001,"d":"8.27 m"}},{"v":6.29,"d":"6.29 m"},{"$f":"P14-(P14-R14)*($Q$1-$P$1)/($R$1-$P$1)","v":{"v":7.970000000000002,"d":"7.97 m"}},{"v":6.01,"d":"6.01 m"},{"$f":"R14-(R14-T14)*($S$1-$R$1)/($T$1-$R$1)","v":{"v":5.941,"d":"5.94 m"}},{"v":5.78,"d":"5.78 m"},{"$f":"T14-(T14-V14)*($U$1-$T$1)/($V$1-$T$1)","v":{"v":7.380000000000003,"d":"7.38 m"}},{"v":5.58,"d":"5.58 m"},{"$f":"V14-(V14-X14)*($W$1-$V$1)/($X$1-$V$1)","v":{"v":7.109999999999999,"d":"7.11 m"}},{"v":5.41,"d":"5.41 m"},{"$f":"X14-(X14-Z14)*($Y$1-$X$1)/($Z$1-$X$1)","v":{"v":7.01,"d":"7.01 m"}},{"v":5.25,"d":"5.25 m"},{"$nulls":10},{"v":3,"d":"3.00 kN/qm"},0.65,null,"579500+100*50*4",{"v":9.73,"d":"9.73 m"},{"$f":"AO14-(AO14-AQ14)*($O$1-$N$1)/($P$1-$N$1)","v":{"v":13.380000000000003,"d":"13.38 m"}},{"v":9,"d":"9.00 m"},{"$f":"AQ14-(AQ14-AS14)*($Q$1-$P$1)/($R$1-$P$1)","v":{"v":12.54,"d":"12.54 m"}},{"v":8.41,"d":"8.41 m"},{"$f":"AS14-(AS14-AU14)*($S$1-$R$1)/($T$1-$R$1)","v":{"v":8.266,"d":"8.27 m"}},{"v":7.93,"d":"7.93 m"},{"$f":"AU14-(AU14-AW14)*($U$1-$T$1)/($V$1-$T$1)","v":{"v":11.21,"d":"11.21 m"}},{"v":7.52,"d":"7.52 m"},{"$f":"AW14-(AW14-AY14)*($W$1-$V$1)/($X$1-$V$1)","v":{"v":10.759999999999994,"d":"10.76 m"}},{"v":7.16,"d":"7.16 m"},{"$f":"AY14-(AY14-BA14)*($Y$1-$X$1)/($Z$1-$X$1)","v":{"v":10.159999999999997,"d":"10.16 m"}},{"v":6.86,"d":"6.86 m"},{"$nulls":10},"1c) Dachneigung","1c) k",null,"579500+100*50*4",{"v":10.49,"d":"10.49 m"},{"$f":"BP14-(BP14-BR14)*($O$1-$N$1)/($P$1-$N$1)","v":{"v":14.540000000000003,"d":"14.54 m"}},{"v":9.68,"d":"9.68 m"},{"$f":"BR14-(BR14-BT14)*($Q$1-$P$1)/($R$1-$P$1)","v":{"v":13.520000000000003,"d":"13.52 m"}},{"v":9.04,"d":"9.04 m"},{"$f":"BT14-(BT14-BV14)*($S$1-$R$1)/($T$1-$R$1)","v":{"v":8.878,"d":"8.88 m"}},{"v":8.5,"d":"8.50 m"},{"$f":"BV14-(BV14-BX14)*($U$1-$T$1)/($V$1-$T$1)","v":{"v":12.019999999999998,"d":"12.02 m"}},{"v":8.06,"d":"8.06 m"},{"$f":"BX14-(BX14-BZ14)*($W$1-$V$1)/($X$1-$V$1)","v":{"v":11.570000000000007,"d":"11.57 m"}},{"v":7.67,"d":"7.67 m"},{"$f":"BZ14-(BZ14-CB14)*($Y$1-$X$1)/($Z$1-$X$1)","v":{"v":10.969999999999997,"d":"10.97 m"}},{"v":7.34,"d":"7.34 m"}]
[{"$nulls":3},{"$f":"IF(B14>D14,\"Bedingung nicht erfüllt!\",\"Bedingung erfüllt!\")","v":"Bedingung erfüllt!"},{"$nulls":8},"579500+100*50*6,3",{"v":7.05,"d":"7.05 m"},{"$f":"N15-(N15-P15)*($O$1-$N$1)/($P$1-$N$1)","v":{"v":8.799999999999999,"d":"8.80 m"}},{"v":6.7,"d":"6.70 m"},{"$f":"P15-(P15-R15)*($Q$1-$P$1)/($R$1-$P$1)","v":{"v":8.440000000000001,"d":"8.44 m"}},{"v":6.41,"d":"6.41 m"},{"$f":"R15-(R15-T15)*($S$1-$R$1)/($T$1-$R$1)","v":{"v":6.338,"d":"6.34 m"}},{"v":6.17,"d":"6.17 m"},{"$f":"T15-(T15-V15)*($U$1-$T$1)/($V$1-$T$1)","v":{"v":7.929999999999999,"d":"7.93 m"}},{"v":5.95,"d":"5.95 m"},{"$f":"V15-(V15-X15)*($W$1-$V$1)/($X$1-$V$1)","v":{"v":7.660000000000004,"d":"7.66 m"}},{"v":5.76,"d":"5.76 m"},{"$f":"X15-(X15-Z15)*($Y$1-$X$1)/($Z$1-$X$1)","v":{"v":7.459999999999997,"d":"7.46 m"}},{"v":5.59,"d":"5.59 m"},{"$nulls":13},"579500+100*50*6,3",{"v":10.69,"d":"10.69 m"},{"$f":"AO15-(AO15-AQ15)*($O$1-$N$1)/($P$1-$N$1)","v":{"v":14.689999999999994,"d":"14.69 m"}},{"v":9.89,"d":"9.89 m"},{"$f":"AQ15-(AQ15-AS15)*($Q$1-$P$1)/($R$1-$P$1)","v":{"v":13.790000000000003,"d":"13.79 m"}},{"v":9.24,"d":"9.24 m"},{"$f":"AS15-(AS15-AU15)*($S$1-$R$1)/($T$1-$R$1)","v":{"v":9.081,"d":"9.08 m"}},{"v":8.71,"d":"8.71 m"},{"$f":"AU15-(AU15-AW15)*($U$1-$T$1)/($V$1-$T$1)","v":{"v":12.31000000000001,"d":"12.31 m"}},{"v":8.26,"d":"8.26 m"},{"$f":"AW15-(AW15-AY15)*($W$1-$V$1)/($X$1-$V$1)","v":{"v":11.769999999999998,"d":"11.77 m"}},{"v":7.87,"d":"7.87 m"},{"$f":"AY15-(AY15-BA15)*($Y$1-$X$1)/($Z$1-$X$1)","v":{"v":11.169999999999998,"d":"11.17 m"}},{"v":7.54,"d":"7.54 m"},{"$nulls":10},{"v":1,"d":"1.00 °"},{"v":1,"d":"1.00"},null,"579500+100*50*6,3",{"v":11.52,"d":"11.52 m"},{"$f":"BP15-(BP15-BR15)*($O$1-$N$1)/($P$1-$N$1)","v":{"v":15.969999999999995,"d":"15.97 m"}},{"v":10.63,"d":"10.63 m"},{"$f":"BR15-(BR15-BT15)*($Q$1-$P$1)/($R$1-$P$1)","v":{"v":14.830000000000009,"d":"14.83 m"}},{"v":9.93,"d":"9.93 m"},{"$f":"BT15-(BT15-BV15)*($S$1-$R$1)/($T$1-$R$1)","v":{"v":9.753,"d":"9.75 m"}},{"v":9.34,"d":"9.34 m"},{"$f":"BV15-(BV15-BX15)*($U$1-$T$1)/($V$1-$T$1)","v":{"v":13.260000000000002,"d":"13.26 m"}},{"v":8.85,"d":"8.85 m"},{"$f":"BX15-(BX15-BZ15)*($W$1-$V$1)/($X$1-$V$1)","v":{"v":12.629999999999999,"d":"12.63 m"}},{"v":8.43,"d":"8.43 m"},{"$f":"BZ15-(BZ15-CB15)*($Y$1-$X$1)/($Z$1-$X$1)","v":{"v":12.129999999999988,"d":"12.13 m"}},{"v":8.06,"d":"8.06 m"}]
[null,"Durchbiegung w","=",{"$f":"((1000/VLOOKUP('Bemessungstabelle isoliert'!D13,Daten!A22:B25,2))*D10^4/H19^3)/COS($D$9*PI()/180)","v":{"v":11.313877170879847,"d":"11 mm"}},{"$nulls":5},"1a) Dachneigung","1a) k",{"$nulls":25},"1b) Dachneigung","1b) k",{"$nulls":25},{"v":10,"d":"10.00 °"},{"v":1,"d":"1.00"}]
[{"$nulls":9},{"v":1,"d":"1.00 °"},{"v":1,"d":"1.00"},{"$nulls":25},{"v":1,"d":"1.00 °"},{"v":1,"d":"1.00"},{"$nulls":25},{"$f":"IF(AND($D$9>BL16,$D$9<BL18),$D$9,\"nicht interpolieren\")","v":"nicht interpolieren"},{"$f":"BM16-(BM16-BM18)*(BL17-BL16)/(BL18-BL16)","v":{"$error":"#VALUE!"}}]
[null,"Bemssungstabelle: Pos. 1.2 Seitenträger isoliert",{"$nulls":4},"1a) Tabellenwert l",{"$f":"O19","v":{"v":4.143,"d":"4.14 m"}},null,{"v":10,"d":"10.00 °"},{"v":1,"d":"1.00"},null,"1a) Träger","Sparren-Achsabstand","l",{"$nulls":18},"1b) Tabellenwert l",{"$f":"AP19","v":{"v":5.869000000000001,"d":"5.87 m"}},null,{"v":10,"d":"10.00 °"},{"v":1,"d":"1.00"},null,"1b) Träger","Sparren-Achsabstand","l",{"$nulls":18},"1c) Tabellenwert l",{"$f":"BQ19","v":{"v":6.27,"d":"6.27 m"}},null,{"v":20,"d":"20.00 °"},{"v":0.99,"d":"0.990"},null,"1c) Träger","Sparren-Achsabstand","l"]
[null,"Seitenträger","=","577337+70*30*3",null,null,"1a) Korrigierter lzul1",{"$f":"H18*H2*H3*H4*H5*H6","v":{"v":4.068426,"d":"4.07 m"}},null,{"$f":"IF(AND($D$9>J18,$D$9<J20),$D$9,\"nicht interpolieren\")","v":"nicht interpolieren"},{"$f":"K18-(K18-K20)*(J19-J18)/(J20-J18)","v":{"$error":"#VALUE!"}},null,{"$f":"IF($D$11=\"\",\"\",MATCH($D$11,M2:M15))","v":9},{"$f":"IF($D$12=\"\",\"\",MATCH($D$12,N1:Z1,0))","v":6},{"$f":"IF(OR($D$11=\"\",$D$12=\"\"),0,INDEX(N2:Z15,M19,N19))","v":{"v":4.143,"d":"4.14 m"}},{"$nulls":18},"1b) Korrigierter lzul1",{"$f":"AI18*AI2*AI3*AI4*AI5*AI6","v":{"v":5.704668000000001,"d":"5.70 m"}},null,{"$f":"IF(AND($D$9>AK18,$D$9<AK20),$D$9,\"nicht interpolieren\")","v":"nicht interpolieren"},{"$f":"AL18-(AL18-AL20)*(AK19-AK18)/(AK20-AK18)","v":{"$error":"#VALUE!"}},null,{"$f":"IF($D$11=\"\",\"\",MATCH($D$11,AN2:AN15))","v":9},{"$f":"IF($D$12=\"\",\"\",MATCH($D$12,AO1:BA1,0))","v":6},{"$f":"IF(OR($D$11=\"\",$D$12=\"\"),0,INDEX(AO2:BA15,AN19,AO19))","v":{"v":5.869000000000001,"d":"5.87 m"}},{"$nulls":18},"1c) Korrigierter lzul1",{"$f":"BJ18*BJ2*BJ3*BJ4*BJ5*BJ6","v":{"v":62699.99999999999,"d":"62,700.00 m"}},null,{"$f":"IF(AND($D$9>BL18,$D$9<BL20),$D$9,\"nicht interpolieren\")","v":"nicht interpolieren"},{"$f":"BM18-(BM18-BM20)*(BL19-BL18)/(BL20-BL18)","v":{"$error":"#VALUE!"}},null,{"$f":"IF($D$11=\"\",\"\",MATCH($D$11,BO2:BO15))","v":9},{"$f":"IF($D$12=\"\",\"\",MATCH($D$12,BP1:CB1,0))","v":6},{"$f":"IF(OR($D$11=\"\",$D$12=\"\"),0,INDEX(BP2:CB15,BO19,BP19))","v":{"v":6.27,"d":"6.27 m"}}]
[null,{"$f":"D10","v":{"v":3.5,"d":"3.50 m"}},{"$f":"IF(B20<D20,\"<\",\">\")","v":"<"},{"$f":"MIN(H32,AI32,BJ32)","v":{"v":4.322764,"d":"4.32 m"}},{"$nulls":5},{"v":20,"d":"20.00 °"},{"v":0.96,"d":"0.960"},{"$nulls":25},{"v":20,"d":"20.00 °"},{"v":0.97,"d":"0.970"},{"$nulls":25},{"v":30,"d":"30.00 °"},0.98]
[{"$nulls":3},{"$f":"IF(B20>D20,\"Bedingung nicht erfüllt!\",\"Bedingung erfüllt!\")","v":"Bedingung erfüllt!"},{"$nulls":5},{"$f":"IF(AND($D$9>J20,$D$9<J22),$D$9,\"nicht interpolieren\")","v":"nicht interpolieren"},{"$f":"K20-(K20-K22)*(J21-J20)/(J22-J20)","v":{"$error":"#VALUE!"}},{"$nulls":25},{"$f":"IF(AND($D$9>AK20,$D$9<AK22),$D$9,\"nicht interpolieren\")","v":"nicht interpolieren"},{"$f":"AL20-(AL20-AL22)*(AK21-AK20)/(AK22-AK20)","v":{"$error":"#VALUE!"}}]
[null,"Durchbiegung w","=",{"$f":"((1000/VLOOKUP('Bemessungstabelle isoliert'!D13,Daten!A22:B25,2))*D10^4/H32^3)/COS($D$9*PI()/180)","v":{"v":9.432051095326234,"d":"9 mm"}},{"$nulls":5},{"v":30,"d":"30.00 °"},0.91,{"$nulls":25},{"v":30,"d":"30.00 °"},0.93]
[]
[null,"Bemessungstabelle: Pos. 2.1 Rinne/Unterzug",{"$nulls":4},"2a) Korrekturfaktoren Seitenträger",{"$nulls":5},"Seitenträger",{"v":0.5,"d":"0.50 m"},{"$f":"IF(AND($D$12>0.5,$D$12<0.6),$D$12,0)","v":{"v":0,"d":"0.00 m"}},{"v":0.6,"d":"0.60 m"},{"$f":"IF(AND($D$12>0.6,$D$12<0.7),$D$12,0)","v":{"v":0,"d":"0.00 m"}},{"v":0.7,"d":"0.70 m"},{"$f":"IF(AND($D$12>0.7,$D$12<0.8),$D$12,0)","v":{"v":0.73,"d":"0.73 m"}},{"v":0.8,"d":"0.80 m"},{"$f":"IF(AND($D$12>0.8,$D$12<0.9),$D$12,0)","v":{"v":0,"d":"0.00 m"}},{"v":0.9,"d":"0.90 m"},{"$f":"IF(AND($D$12>0.9,$D$12<1),$D$12,0)","v":{"v":0,"d":"0.00 m"}},{"v":1,"d":"1.00 m"},{"$f":"IF(AND($D$12>1,$D$12<1.1),$D$12,0)","v":{"v":0,"d":"0.00 m"}},{"v":1.1,"d":"1.10 m"},{"$nulls":7},"2b) Korrekturfaktoren Seitenträger",{"$nulls":5},"Seitenträger",{"v":0.5,"d":"0.50 m"},{"$f":"IF(AND($D$12>0.5,$D$12<0.6),$D$12,0)","v":{"v":0,"d":"0.00 m"}},{"v":0.6,"d":"0.60 m"},{"$f":"IF(AND($D$12>0.6,$D$12<0.7),$D$12,0)","v":{"v":0,"d":"0.00 m"}},{"v":0.7,"d":"0.70 m"},{"$f":"IF(AND($D$12>0.7,$D$12<0.8),$D$12,0)","v":{"v":0.73,"d":"0.73 m"}},{"v":0.8,"d":"0.80 m"},{"$f":"IF(AND($D$12>0.8,$D$12<0.9),$D$12,0)","v":{"v":0,"d":"0.00 m"}},{"v":0.9,"d":"0.90 m"},{"$f":"IF(AND($D$12>0.9,$D$12<1),$D$12,0)","v":{"v":0,"d":"0.00 m"}},{"v":1,"d":"1.00 m"},{"$f":"IF(AND($D$12>1,$D$12<1.1),$D$12,0)","v":{"v":0,"d":"0.00 m"}},{"v":1.1,"d":"1.10 m"},{"$nulls":7},"2c) Korrekturfaktoren Seitenträger",{"$nulls":5},"Seitenträger",{"v":0.5,"d":"0.50 m"},{"$f":"IF(AND($D$12>0.5,$D$12<0.6),$D$12,0)","v":{"v":0,"d":"0.00 m"}},{"v":0.6,"d":"0.60 m"},{"$f":"IF(AND($D$12>0.6,$D$12<0.7),$D$12,0)","v":{"v":0,"d":"0.00 m"}},{"v":0.7,"d":"0.70 m"},{"$f":"IF(AND($D$12>0.7,$D$12<0.8),$D$12,0)","v":{"v":0.73,"d":"0.73 m"}},{"v":0.8,"d":"0.80 m"},{"$f":"IF(AND($D$12>0.8,$D$12<0.9),$D$12,0)","v":{"v":0,"d":"0.00 m"}},{"v":0.9,"d":"0.90 m"},{"$f":"IF(AND($D$12>0.9,$D$12<1),$D$12,0)","v":{"v":0,"d":"0.00 m"}},{"v":1,"d":"1.00 m"},{"$f":"IF(AND($D$12>1,$D$12<1.1),$D$12,0)","v":{"v":0,"d":"0.00 m"}},{"v":1.1,"d":"1.10 m"}]
[null,"max. Stützweite b","=",{"v":5.1,"d":"5.10  m"},null,null,"2a) Verglasung",{"$f":"H2","v":{"v":1,"d":"1.000"}},{"$nulls":4},"577102",{"v":2.98,"d":"2.98 m"},{"$f":"N25-(N25-P25)*($O$24-$N$24)/($P$24-$N$24)","v":{"v":3.780000000000001,"d":"3.78 m"}},{"v":2.82,"d":"2.82 m"},{"$f":"P25-(P25-R25)*($Q$24-$P$24)/($R$24-$P$24)","v":{"v":3.5399999999999983,"d":"3.54 m"}},{"v":2.7,"d":"2.70 m"},{"$f":"R25-(R25-T25)*($S$24-$R$24)/($T$24-$R$24)","v":{"v":2.6670000000000003,"d":"2.67 m"}},{"v":2.59,"d":"2.59 m"},{"$f":"T25-(T25-V25)*($U$24-$T$24)/($V$24-$T$24)","v":{"v":3.3099999999999987,"d":"3.31 m"}},{"v":2.5,"d":"2.50 m"},{"$f":"V25-(V25-X25)*($W$24-$V$24)/($X$24-$V$24)","v":{"v":3.2200000000000006,"d":"3.22 m"}},{"v":2.42,"d":"2.42 m"},{"$f":"X25-(X25-Z25)*($Y$24-$X$24)/($Z$24-$X$24)","v":{"v":3.1199999999999974,"d":"3.12 m"}},{"v":2.35,"d":"2.35 m"},{"$nulls":7},"2b) Verglasung",{"$f":"AI2","v":{"v":1,"d":"1.000"}},{"$nulls":4},"577102",{"v":3.77,"d":"3.77 m"},{"$f":"AO25-(AO25-AQ25)*($O$24-$N$24)/($P$24-$N$24)","v":{"v":5.220000000000001,"d":"5.22 m"}},{"v":3.48,"d":"3.48 m"},{"$f":"AQ25-(AQ25-AS25)*($Q$24-$P$24)/($R$24-$P$24)","v":{"v":4.919999999999999,"d":"4.92 m"}},{"v":3.24,"d":"3.24 m"},{"$f":"AS25-(AS25-AU25)*($S$24-$R$24)/($T$24-$R$24)","v":{"v":3.1830000000000003,"d":"3.18 m"}},{"v":3.05,"d":"3.05 m"},{"$f":"AU25-(AU25-AW25)*($U$24-$T$24)/($V$24-$T$24)","v":{"v":4.329999999999997,"d":"4.33 m"}},{"v":2.89,"d":"2.89 m"},{"$f":"AW25-(AW25-AY25)*($W$24-$V$24)/($X$24-$V$24)","v":{"v":4.150000000000001,"d":"4.15 m"}},{"v":2.75,"d":"2.75 m"},{"$f":"AY25-(AY25-BA25)*($Y$24-$X$24)/($Z$24-$X$24)","v":{"v":3.95,"d":"3.95 m"}},{"v":2.63,"d":"2.63 m"},{"$nulls":7},"2c) Verglasung",{"$f":"BJ2","v":{"v":1,"d":"1.000"}},{"$nulls":4},"577102",{"v":4.01,"d":"4.01 m"},{"$f":"BP25-(BP25-BR25)*($O$24-$N$24)/($P$24-$N$24)","v":{"v":5.559999999999999,"d":"5.56 m"}},{"v":3.7,"d":"3.70 m"},{"$f":"BR25-(BR25-BT25)*($Q$24-$P$24)/($R$24-$P$24)","v":{"v":5.1400000000000015,"d":"5.14 m"}},{"v":3.46,"d":"3.46 m"},{"$f":"BT25-(BT25-BV25)*($S$24-$R$24)/($T$24-$R$24)","v":{"v":3.397,"d":"3.40 m"}},{"v":3.25,"d":"3.25 m"},{"$f":"BV25-(BV25-BX25)*($U$24-$T$24)/($V$24-$T$24)","v":{"v":4.609999999999999,"d":"4.61 m"}},{"v":3.08,"d":"3.08 m"},{"$f":"BX25-(BX25-BZ25)*($W$24-$V$24)/($X$24-$V$24)","v":{"v":4.43,"d":"4.43 m"}},{"v":2.93,"d":"2.93 m"},{"$f":"BZ25-(BZ25-CB25)*($Y$24-$X$24)/($Z$24-$X$24)","v":{"v":4.13,"d":"4.13 m"}},{"v":2.81,"d":"2.81 m"}]
[null,"Rinne","=","579226",null,null,"2a) Schnee",{"$f":"H3","v":0.982},{"$nulls":4},"577104",{"v":3.28,"d":"3.28 m"},{"v":4.2299999999999995,"d":"4.23 m"},{"v":3.09,"d":"3.09 m"},{"v":4.049999999999998,"d":"4.05 m"},{"v":2.93,"d":"2.93 m"},{"v":2.891,"d":"2.89 m"},{"v":2.8,"d":"2.80 m"},{"v":3.6799999999999993,"d":"3.68 m"},{"v":2.69,"d":"2.69 m"},{"v":3.499999999999999,"d":"3.50 m"},{"v":2.6,"d":"2.60 m"},{"v":3.500000000000002,"d":"3.50 m"},{"v":2.51,"d":"2.51 m"},{"$nulls":7},"2b) Schnee",{"$f":"AI3","v":0.972},{"$nulls":4},"577104",{"v":4.91,"d":"4.91 m"},{"v":6.8100000000000005,"d":"6.81 m"},{"v":4.53,"d":"4.53 m"},{"v":6.329999999999999,"d":"6.33 m"},{"v":4.23,"d":"4.23 m"},{"v":4.155,"d":"4.16 m"},{"v":3.98,"d":"3.98 m"},{"v":5.66,"d":"5.66 m"},{"v":3.77,"d":"3.77 m"},{"v":5.390000000000002,"d":"5.39 m"},{"v":3.59,"d":"3.59 m"},{"v":5.189999999999996,"d":"5.19 m"},{"v":3.43,"d":"3.43 m"},{"$nulls":7},"2c) Schnee",{"$f":"BJ3","v":{"v":10000,"d":"10000.000"}},{"$nulls":4},"577104",{"v":5.24,"d":"5.24 m"},{"v":7.290000000000001,"d":"7.29 m"},{"v":4.83,"d":"4.83 m"},{"v":6.750000000000002,"d":"6.75 m"},{"v":4.51,"d":"4.51 m"},{"v":4.429,"d":"4.43 m"},{"v":4.24,"d":"4.24 m"},{"v":6.0800000000000045,"d":"6.08 m"},{"v":4.01,"d":"4.01 m"},{"v":5.72,"d":"5.72 m"},{"v":3.82,"d":"3.82 m"},{"v":5.4199999999999955,"d":"5.42 m"},{"v":3.66,"d":"3.66 m"}]
[null,"zul. Durchbiegung","=","l/300","Info",null,"2a) Wind",{"$f":"H4","v":{"v":1,"d":"1.000"}},{"$nulls":4},"577337",{"v":4.11,"d":"4.11 m"},{"v":5.160000000000003,"d":"5.16 m"},{"v":3.9,"d":"3.90 m"},{"v":4.92,"d":"4.92 m"},{"v":3.73,"d":"3.73 m"},{"v":3.685,"d":"3.69 m"},{"v":3.58,"d":"3.58 m"},{"v":4.619999999999999,"d":"4.62 m"},{"v":3.45,"d":"3.45 m"},{"v":4.440000000000003,"d":"4.44 m"},{"v":3.34,"d":"3.34 m"},{"v":4.2399999999999975,"d":"4.24 m"},{"v":3.25,"d":"3.25 m"},{"$nulls":7},"2b) Wind",{"$f":"AI4","v":{"v":1,"d":"1.000"}},{"$nulls":4},"577337",{"v":5.19,"d":"5.19 m"},{"v":7.190000000000003,"d":"7.19 m"},{"v":4.79,"d":"4.79 m"},{"v":6.649999999999998,"d":"6.65 m"},{"v":4.48,"d":"4.48 m"},{"v":4.399,"d":"4.40 m"},{"v":4.21,"d":"4.21 m"},{"v":5.969999999999999,"d":"5.97 m"},{"v":3.99,"d":"3.99 m"},{"v":5.700000000000004,"d":"5.70 m"},{"v":3.8,"d":"3.80 m"},{"v":5.399999999999995,"d":"5.40 m"},{"v":3.64,"d":"3.64 m"},{"$nulls":7},"2c) Wind",{"$f":"BJ4","v":{"v":1,"d":"1.000"}},{"$nulls":4},"577337",{"v":5.54,"d":"5.54 m"},{"v":7.6899999999999995,"d":"7.69 m"},{"v":5.11,"d":"5.11 m"},{"v":7.150000000000006,"d":"7.15 m"},{"v":4.77,"d":"4.77 m"},{"v":4.686,"d":"4.69 m"},{"v":4.49,"d":"4.49 m"},{"v":6.3300000000000045,"d":"6.33 m"},{"v":4.26,"d":"4.26 m"},{"v":6.060000000000002,"d":"6.06 m"},{"v":4.06,"d":"4.06 m"},{"v":5.859999999999995,"d":"5.86 m"},{"v":3.88,"d":"3.88 m"}]
[null,{"$f":"D25","v":{"v":5.1,"d":"5.10 m"}},{"$f":"IF(B28<D28,\"<\",\">\")","v":">"},{"$f":"MIN(H53,AI53,BJ53)","v":{"v":2.758317705,"d":"2.76 m"}},null,null,"2a) Dachneigung",{"$f":"H5","v":{"v":1,"d":"1.000"}},{"$nulls":4},"577337+70*30*3",{"v":4.87,"d":"4.87 m"},{"v":6.020000000000002,"d":"6.02 m"},{"v":4.64,"d":"4.64 m"},{"v":5.779999999999997,"d":"5.78 m"},{"v":4.45,"d":"4.45 m"},{"v":4.402,"d":"4.40 m"},{"v":4.29,"d":"4.29 m"},{"v":5.4099999999999975,"d":"5.41 m"},{"v":4.15,"d":"4.15 m"},{"v":5.320000000000007,"d":"5.32 m"},{"v":4.02,"d":"4.02 m"},{"v":5.119999999999993,"d":"5.12 m"},{"v":3.91,"d":"3.91 m"},{"$nulls":7},"2b) Dachneigung",{"$f":"AI5","v":{"v":1,"d":"1.000"}},{"$nulls":4},"577337+70*30*3",{"v":6.73,"d":"6.73 m"},{"v":14.080000000000005,"d":"14.08 m"},{"v":5.26,"d":"5.26 m"},{"v":1.5999999999999974,"d":"1.60 m"},{"v":5.87,"d":"5.87 m"},{"v":5.774,"d":"5.77 m"},{"v":5.55,"d":"5.55 m"},{"v":7.790000000000003,"d":"7.79 m"},{"v":5.27,"d":"5.27 m"},{"v":7.339999999999996,"d":"7.34 m"},{"v":5.04,"d":"5.04 m"},{"v":7.139999999999998,"d":"7.14 m"},{"v":4.83,"d":"4.83 m"},{"$nulls":7},"2c) Dachneigung",{"$f":"BJ5","v":{"v":1,"d":"1.000"}},{"$nulls":4},"577337+70*30*3",{"v":7.23,"d":"7.23 m"},{"v":9.830000000000004,"d":"9.83 m"},{"v":6.71,"d":"6.71 m"},{"v":9.23,"d":"9.23 m"},{"v":6.29,"d":"6.29 m"},{"v":6.1850000000000005,"d":"6.19 m"},{"v":5.94,"d":"5.94 m"},{"v":8.260000000000002,"d":"8.26 m"},{"v":5.65,"d":"5.65 m"},{"v":7.990000000000007,"d":"7.99 m"},{"v":5.39,"d":"5.39 m"},{"v":7.689999999999992,"d":"7.69 m"},{"v":5.16,"d":"5.16 m"}]
[{"$nulls":3},{"$f":"IF(B28>D28,\"Bedingung nicht erfüllt!\",\"Bedingung erfüllt!\")","v":"Bedingung nicht erfüllt!"},null,null,"2a) zul. Durchbiegung",{"$f":"H6","v":{"v":1,"d":"1.000"}},{"$nulls":4},"579501",{"v":5.6,"d":"5.60 m"},{"v":7.05,"d":"7.05 m"},{"v":5.31,"d":"5.31 m"},{"v":6.689999999999997,"d":"6.69 m"},{"v":5.08,"d":"5.08 m"},{"v":5.02,"d":"5.02 m"},{"v":4.88,"d":"4.88 m"},{"v":6.24,"d":"6.24 m"},{"v":4.71,"d":"4.71 m"},{"v":6.060000000000003,"d":"6.06 m"},{"v":4.56,"d":"4.56 m"},{"v":5.859999999999998,"d":"5.86 m"},{"v":4.43,"d":"4.43 m"},{"$nulls":7},"2b) zul. Durchbiegung",{"$f":"AI6","v":{"v":1,"d":"1.000"}},{"$nulls":4},"579501",{"v":7.55,"d":"7.55 m"},{"v":10.399999999999997,"d":"10.40 m"},{"v":6.98,"d":"6.98 m"},{"v":9.740000000000006,"d":"9.74 m"},{"v":6.52,"d":"6.52 m"},{"v":6.409,"d":"6.41 m"},{"v":6.15,"d":"6.15 m"},{"v":8.710000000000003,"d":"8.71 m"},{"v":5.83,"d":"5.83 m"},{"v":8.350000000000003,"d":"8.35 m"},{"v":5.55,"d":"5.55 m"},{"v":7.949999999999999,"d":"7.95 m"},{"v":5.31,"d":"5.31 m"},{"$nulls":7},"2c) zul. Durchbiegung",{"$f":"BJ6","v":{"v":1,"d":"1.000"}},{"$nulls":4},"579501",{"v":8.07,"d":"8.07 m"},{"v":11.170000000000002,"d":"11.17 m"},{"v":7.45,"d":"7.45 m"},{"v":10.390000000000002,"d":"10.39 m"},{"v":6.96,"d":"6.96 m"},{"v":6.84,"d":"6.84 m"},{"v":6.56,"d":"6.56 m"},{"v":9.359999999999998,"d":"9.36 m"},{"v":6.21,"d":"6.21 m"},{"v":8.82,"d":"8.82 m"},{"v":5.92,"d":"5.92 m"},{"v":8.519999999999996,"d":"8.52 m"},{"v":5.66,"d":"5.66 m"}]
[null,"Durchbiegung w","=",{"$f":"(1000/VLOOKUP('Bemessungstabelle isoliert'!$D$27,Daten!$A$22:$B$25,2))*$D$25^4/$H$53^3","v":{"v":107.45499009437634,"d":"107 mm"}},{"$nulls":8},"579501+100*50*4",{"v":7.13,"d":"7.13 m"},{"v":8.679999999999998,"d":"8.68 m"},{"v":6.82,"d":"6.82 m"},{"v":8.380000000000004,"d":"8.38 m"},{"v":6.56,"d":"6.56 m"},{"v":6.494,"d":"6.49 m"},{"v":6.34,"d":"6.34 m"},{"v":7.940000000000001,"d":"7.94 m"},{"v":6.14,"d":"6.14 m"},{"v":7.67,"d":"7.67 m"},{"v":5.97,"d":"5.97 m"},{"v":7.57,"d":"7.57 m"},{"v":5.81,"d":"5.81 m"},{"$nulls":13},"579501+100*50*4",{"v":10.89,"d":"10.89 m"},{"v":14.390000000000008,"d":"14.39 m"},{"v":10.19,"d":"10.19 m"},{"v":13.67,"d":"13.67 m"},{"v":9.61,"d":"9.61 m"},{"v":9.463,"d":"9.46 m"},{"v":9.12,"d":"9.12 m"},{"v":12.48,"d":"12.48 m"},{"v":8.7,"d":"8.70 m"},{"v":12.029999999999994,"d":"12.03 m"},{"v":8.33,"d":"8.33 m"},{"v":11.629999999999997,"d":"11.63 m"},{"v":8,"d":"8.00 m"},{"$nulls":13},"579501+100*50*4",{"v":11.78,"d":"11.78 m"},{"v":15.679999999999996,"d":"15.68 m"},{"v":11,"d":"11.00 m"},{"v":14.840000000000003,"d":"14.84 m"},{"v":10.36,"d":"10.36 m"},{"v":10.198,"d":"10.20 m"},{"v":9.82,"d":"9.82 m"},{"v":13.580000000000007,"d":"13.58 m"},{"v":9.35,"d":"9.35 m"},{"v":12.950000000000003,"d":"12.95 m"},{"v":8.95,"d":"8.95 m"},{"v":12.54999999999999,"d":"12.55 m"},{"v":8.59,"d":"8.59 m"}]
[null,"zul. Durchbiegung wzul.","=",{"$f":"D25*1000/VLOOKUP($D$27,Daten!$A$22:$B$25,2)","v":{"v":17,"d":"17 mm"}},null,null,"2a) Tabellenwert l",{"$f":"O35","v":{"v":4.402,"d":"4.40 m"}},{"$nulls":4},"579501+100*50*6,3",{"v":7.56,"d":"7.56 m"},{"$f":"N31-(N31-P31)*($O$24-$N$24)/($P$24-$N$24)","v":{"v":9.109999999999998,"d":"9.11 m"}},{"v":7.25,"d":"7.25 m"},{"$f":"P31-(P31-R31)*($Q$24-$P$24)/($R$24-$P$24)","v":{"v":8.809999999999999,"d":"8.81 m"}},{"v":6.99,"d":"6.99 m"},{"$f":"R31-(R31-T31)*($S$24-$R$24)/($T$24-$R$24)","v":{"v":6.918,"d":"6.92 m"}},{"v":6.75,"d":"6.75 m"},{"$f":"T31-(T31-V31)*($U$24-$T$24)/($V$24-$T$24)","v":{"v":8.350000000000001,"d":"8.35 m"}},{"v":6.55,"d":"6.55 m"},{"$f":"V31-(V31-X31)*($W$24-$V$24)/($X$24-$V$24)","v":{"v":8.169999999999998,"d":"8.17 m"}},{"v":6.37,"d":"6.37 m"},{"$f":"X31-(X31-Z31)*($Y$24-$X$24)/($Z$24-$X$24)","v":{"v":7.970000000000001,"d":"7.97 m"}},{"v":6.21,"d":"6.21 m"},{"$nulls":7},"2b) Tabellenwert l",{"$f":"AP35","v":{"v":5.774,"d":"5.77 m"}},{"$nulls":4},"579501+100*50*6,3",{"v":11.94,"d":"11.94 m"},{"$f":"AO31-(AO31-AQ31)*($O$24-$N$24)/($P$24-$N$24)","v":{"v":15.64,"d":"15.64 m"}},{"v":11.2,"d":"11.20 m"},{"$f":"AQ31-(AQ31-AS31)*($Q$24-$P$24)/($R$24-$P$24)","v":{"v":14.919999999999995,"d":"14.92 m"}},{"v":10.58,"d":"10.58 m"},{"$f":"AS31-(AS31-AU31)*($S$24-$R$24)/($T$24-$R$24)","v":{"v":10.421,"d":"10.42 m"}},{"v":10.05,"d":"10.05 m"},{"$f":"AU31-(AU31-AW31)*($U$24-$T$24)/($V$24-$T$24)","v":{"v":13.73000000000001,"d":"13.73 m"}},{"v":9.59,"d":"9.59 m"},{"$f":"AW31-(AW31-AY31)*($W$24-$V$24)/($X$24-$V$24)","v":{"v":13.100000000000005,"d":"13.10 m"}},{"v":9.2,"d":"9.20 m"},{"$f":"AY31-(AY31-BA31)*($Y$24-$X$24)/($Z$24-$X$24)","v":{"v":12.79999999999999,"d":"12.80 m"}},{"v":8.84,"d":"8.84 m"},{"$nulls":7},"2c) Tabellenwert l",{"$f":"BQ35","v":{"v":6.1850000000000005,"d":"6.19 m"}},{"$nulls":4},"579501+100*50*6,3",{"v":12.96,"d":"12.96 m"},{"$f":"BP31-(BP31-BR31)*($O$24-$N$24)/($P$24-$N$24)","v":{"v":17.16000000000001,"d":"17.16 m"}},{"v":12.12,"d":"12.12 m"},{"$f":"BR31-(BR31-BT31)*($Q$24-$P$24)/($R$24-$P$24)","v":{"v":16.319999999999997,"d":"16.32 m"}},{"v":11.42,"d":"11.42 m"},{"$f":"BT31-(BT31-BV31)*($S$24-$R$24)/($T$24-$R$24)","v":{"v":11.246,"d":"11.25 m"}},{"v":10.84,"d":"10.84 m"},{"$f":"BV31-(BV31-BX31)*($U$24-$T$24)/($V$24-$T$24)","v":{"v":14.919999999999998,"d":"14.92 m"}},{"v":10.33,"d":"10.33 m"},{"$f":"BX31-(BX31-BZ31)*($W$24-$V$24)/($X$24-$V$24)","v":{"v":14.2,"d":"14.20 m"}},{"v":9.9,"d":"9.90 m"},{"$f":"BZ31-(BZ31-CB31)*($Y$24-$X$24)/($Z$24-$X$24)","v":{"v":13.800000000000002,"d":"13.80 m"}},{"v":9.51,"d":"9.51 m"}]
[null,"2-Feldbalken b + b",{"$nulls":4},"2a) Korrigierter lzul1",{"$f":"H31*H25*H26*H27*H28*H29","v":{"v":4.322764,"d":"4.32 m"}},{"$nulls":25},"2b) Korrigierter lzul1",{"$f":"AI31*AI25*AI26*AI27*AI28*AI29","v":{"v":5.612328,"d":"5.61 m"}},{"$nulls":25},"2c) Korrigierter lzul1",{"$f":"BJ31*BJ25*BJ26*BJ27*BJ28*BJ29","v":{"v":61850.00000000001,"d":"61,850.00 m"}}]
[null,"Durchbiegung w","=",{"$f":"(1000/VLOOKUP('Bemessungstabelle isoliert'!$D$27,Daten!$A$22:$B$25,2))*$D$25^4/($H$53*H49)^3","v":{"v":44.659328979286144,"d":"45 mm"}}]
[{"$nulls":12},"Seitenträger","Sparren-Achsabstand","l",{"$nulls":24},"Seitenträger","Sparren-Achsabstand","l",{"$nulls":24},"Seitenträger","Sparren-Achsabstand","l"]
[null,"Bemessungstabelle: Pos. 1.11 Gratsparren (Typ 5)",{"$nulls":10},{"$f":"IF($D$19=\"\",\"\",MATCH($D$19,M25:M31))","v":4},{"$f":"IF($D$12=\"\",\"\",MATCH($D$12,N24:Z24,0))","v":6},{"$f":"IF(OR($D$19=\"\",$D$12=\"\"),0,INDEX(N25:Z31,M35,N35))","v":{"v":4.402,"d":"4.40 m"}},{"$nulls":24},{"$f":"IF($D$19=\"\",\"\",MATCH($D$19,AN25:AN31))","v":4},{"$f":"IF($D$12=\"\",\"\",MATCH($D$12,AO24:BA24,0))","v":6},{"$f":"IF(OR($D$19=\"\",$D$12=\"\"),0,INDEX(AO25:BA31,AN35,AO35))","v":{"v":5.774,"d":"5.77 m"}},{"$nulls":24},{"$f":"IF($D$19=\"\",\"\",MATCH($D$19,BO25:BO31))","v":4},{"$f":"IF($D$12=\"\",\"\",MATCH($D$12,BP24:CB24,0))","v":6},{"$f":"IF(OR($D$19=\"\",$D$12=\"\"),0,INDEX(BP25:CB31,BO35,BP35))","v":{"v":6.1850000000000005,"d":"6.19 m"}}]
[null,"Tiefe Abwalumung c","=",{"v":0.8,"d":"0.80 m"},{"$f":"IF(OR(D36<0.5,D36>1.1),\"Achtung: Tiefe muss zwischen 0,50 m und 1,10 m betragen!\",\"\")","v":""}]
[null,"zul. Durchbiegung","=","l/200"]
[null,"Gratsparren","=","579504/5 + 100x20"]
[null,{"$f":"D10","v":{"v":3.5,"d":"3.50 m"}},{"$f":"IF(B39<D39,\"<\",\">\")","v":"<"},{"$f":"MIN(H80,AI80,BJ80)","v":{"v":6.9231,"d":"6.92 m"}}]
[{"$nulls":3},{"$f":"IF(B39>D39,\"Bedingung nicht erfüllt!\",\"Bedingung erfüllt!\")","v":"Bedingung erfüllt!"}]
[{"$nulls":6},"3a) Korrekturfaktoren",null,null,"3a) sDA","3a) ki",null,"Rinne",{"v":1,"d":"1.00 m"},{"$f":"IF(AND('Ermittlung Schneelast'!$D$19>1,'Ermittlung Schneelast'!$D$19<1.5),'Ermittlung Schneelast'!$D$19,0)","v":{"v":0,"d":"0.00 m"}},{"v":1.5,"d":"1.50 m"},{"$f":"IF(AND('Ermittlung Schneelast'!$D$19>1.5,'Ermittlung Schneelast'!$D$19<2),'Ermittlung Schneelast'!$D$19,0)","v":{"v":0,"d":"0.00 m"}},{"v":2,"d":"2.00 m"},{"$f":"IF(AND('Ermittlung Schneelast'!$D$19>2,'Ermittlung Schneelast'!$D$19<2.5),'Ermittlung Schneelast'!$D$19,0)","v":{"v":0,"d":"0.00 m"}},{"v":2.5,"d":"2.50 m"},{"$f":"IF(AND('Ermittlung Schneelast'!$D$19>2.5,'Ermittlung Schneelast'!$D$19<3),'Ermittlung Schneelast'!$D$19,0)","v":{"v":0,"d":"0.00 m"}},{"v":3,"d":"3.00 m"},{"$f":"IF(AND('Ermittlung Schneelast'!$D$19>3,'Ermittlung Schneelast'!$D$19<3.5),'Ermittlung Schneelast'!$D$19,0)","v":{"v":0,"d":"0.00 m"}},{"v":3.5,"d":"3.50 m"},{"$f":"IF(AND('Ermittlung Schneelast'!$D$19>3.5,'Ermittlung Schneelast'!$D$19<4),'Ermittlung Schneelast'!$D$19,0)","v":{"v":0,"d":"0.00 m"}},{"v":4,"d":"4.00 m"},{"$f":"IF(AND('Ermittlung Schneelast'!$D$19>4,'Ermittlung Schneelast'!$D$19<4.5),'Ermittlung Schneelast'!$D$19,0)","v":{"v":0,"d":"0.00 m"}},{"v":4.5,"d":"4.50 m"},{"$f":"IF(AND('Ermittlung Schneelast'!$D$19>4.5,'Ermittlung Schneelast'!$D$19<5),'Ermittlung Schneelast'!$D$19,0)","v":{"v":0,"d":"0.00 m"}},{"v":5,"d":"5.00 m"},{"$f":"IF(AND('Ermittlung Schneelast'!D$19>5,'Ermittlung Schneelast'!D$19<6),'Ermittlung Schneelast'!D$19,0)","v":{"v":0,"d":"0.00 m"}},{"v":6,"d":"6.00 m"},null,"3b) Korrekturfaktoren",null,null,"3b) sDA","3b) ki",null,"Rinne",{"v":1,"d":"1.00 m"},{"$f":"IF(AND('Ermittlung Schneelast'!$D$19>1,'Ermittlung Schneelast'!$D$19<1.5),'Ermittlung Schneelast'!$D$19,0)","v":{"v":0,"d":"0.00 m"}},{"v":1.5,"d":"1.50 m"},{"$f":"IF(AND('Ermittlung Schneelast'!$D$19>1.5,'Ermittlung Schneelast'!$D$19<2),'Ermittlung Schneelast'!$D$19,0)","v":{"v":0,"d":"0.00 m"}},{"v":2,"d":"2.00 m"},{"$f":"IF(AND('Ermittlung Schneelast'!$D$19>2,'Ermittlung Schneelast'!$D$19<2.5),'Ermittlung Schneelast'!$D$19,0)","v":{"v":0,"d":"0.00 m"}},{"v":2.5,"d":"2.50 m"},{"$f":"IF(AND('Ermittlung Schneelast'!$D$19>2.5,'Ermittlung Schneelast'!$D$19<3),'Ermittlung Schneelast'!$D$19,0)","v":{"v":0,"d":"0.00 m"}},{"v":3,"d":"3.00 m"},{"$f":"IF(AND('Ermittlung Schneelast'!$D$19>3,'Ermittlung Schneelast'!$D$19<3.5),'Ermittlung Schneelast'!$D$19,0)","v":{"v":0,"d":"0.00 m"}},{"v":3.5,"d":"3.50 m"},{"$f":"IF(AND('Ermittlung Schneelast'!$D$19>3.5,'Ermittlung Schneelast'!$D$19<4),'Ermittlung Schneelast'!$D$19,0)","v":{"v":0,"d":"0.00 m"}},{"v":4,"d":"4.00 m"},{"$f":"IF(AND('Ermittlung Schneelast'!$D$19>4,'Ermittlung Schneelast'!$D$19<4.5),'Ermittlung Schneelast'!$D$19,0)","v":{"v":0,"d":"0.00 m"}},{"v":4.5,"d":"4.50 m"},{"$f":"IF(AND('Ermittlung Schneelast'!$D$19>4.5,'Ermittlung Schneelast'!$D$19<5),'Ermittlung Schneelast'!$D$19,0)","v":{"v":0,"d":"0.00 m"}},{"v":5,"d":"5.00 m"},{"$f":"IF(AND('Ermittlung Schneelast'!$D$19>5,'Ermittlung Schneelast'!$D$19<6),'Ermittlung Schneelast'!$D$19,0)","v":{"v":0,"d":"0.00 m"}},{"v":6,"d":"6.00 m"},null,"3c) Korrekturfaktoren",{"$nulls":5},"Rinne",{"v":1,"d":"1.00 m"},{"$f":"IF(AND('Ermittlung Schneelast'!$D$19>1,'Ermittlung Schneelast'!$D$19<1.5),'Ermittlung Schneelast'!$D$19,0)","v":{"v":0,"d":"0.00 m"}},{"v":1.5,"d":"1.50 m"},{"$f":"IF(AND('Ermittlung Schneelast'!$D$19>1.5,'Ermittlung Schneelast'!$D$19<2),'Ermittlung Schneelast'!$D$19,0)","v":{"v":0,"d":"0.00 m"}},{"v":2,"d":"2.00 m"},{"$f":"IF(AND('Ermittlung Schneelast'!$D$19>2,'Ermittlung Schneelast'!$D$19<2.5),'Ermittlung Schneelast'!$D$19,0)","v":{"v":0,"d":"0.00 m"}},{"v":2.5,"d":"2.50 m"},{"$f":"IF(AND('Ermittlung Schneelast'!$D$19>2.5,'Ermittlung Schneelast'!$D$19<3),'Ermittlung Schneelast'!$D$19,0)","v":{"v":0,"d":"0.00 m"}},{"v":3,"d":"3.00 m"},{"$f":"IF(AND('Ermittlung Schneelast'!$D$19>3,'Ermittlung Schneelast'!$D$19<3.5),'Ermittlung Schneelast'!$D$19,0)","v":{"v":0,"d":"0.00 m"}},{"v":3.5,"d":"3.50 m"},{"$f":"IF(AND('Ermittlung Schneelast'!$D$19>3.5,'Ermittlung Schneelast'!$D$19<4),'Ermittlung Schneelast'!$D$19,0)","v":{"v":0,"d":"0.00 m"}},{"v":4,"d":"4.00 m"},{"$f":"IF(AND('Ermittlung Schneelast'!$D$19>4,'Ermittlung Schneelast'!$D$19<4.5),'Ermittlung Schneelast'!$D$19,0)","v":{"v":0,"d":"0.00 m"}},{"v":4.5,"d":"4.50 m"},{"$f":"IF(AND('Ermittlung Schneelast'!$D$19>4.5,'Ermittlung Schneelast'!$D$19<5),'Ermittlung Schneelast'!$D$19,0)","v":{"v":0,"d":"0.00 m"}},{"v":5,"d":"5.00 m"},{"$f":"IF(AND('Ermittlung Schneelast'!$D$19>5,'Ermittlung Schneelast'!$D$19<6),'Ermittlung Schneelast'!$D$19,0)","v":{"v":0,"d":"0.00 m"}},{"v":6,"d":"6.00 m"}]
[null,"Bemessungstabelle: Pos. 1.12 Gratsparren (Typ 17)",{"$nulls":4},"3a) Verglasung",{"$f":"H2","v":{"v":1,"d":"1.000"}},null,{"v":0.52,"d":"0.52 kN/qm"},{"v":1.1,"d":"1.10"},null,"5772033",{"$f":"P42+(R42-T42)","v":{"v":4.94,"d":"4.94 m"}},{"$f":"N42-(N42-P42)*(O$41-N$41)/(P$41-N$41)","v":{"v":5.500000000000001,"d":"5.50 m"}},{"$f":"R42+(R42-T42)","v":{"v":4.66,"d":"4.66 m"}},{"$f":"P42-(P42-R42)*(Q$41-P$41)/(R$41-P$41)","v":{"v":5.500000000000001,"d":"5.50 m"}},{"v":4.38,"d":"4.38 m"},{"$f":"R42-(R42-T42)*(S$41-R$41)/(T$41-R$41)","v":{"v":5.500000000000001,"d":"5.50 m"}},{"v":4.1,"d":"4.10 m"},{"$f":"T42-(T42-V42)*(U$41-T$41)/(V$41-T$41)","v":{"v":5.199999999999998,"d":"5.20 m"}},{"v":3.88,"d":"3.88 m"},{"$f":"V42-(V42-X42)*(W$41-V$41)/(X$41-V$41)","v":{"v":4.959999999999998,"d":"4.96 m"}},{"v":3.7,"d":"3.70 m"},{"$f":"X42-(X42-Z42)*(Y$41-X$41)/(Z$41-X$41)","v":{"v":4.750000000000003,"d":"4.75 m"}},{"v":3.55,"d":"3.55 m"},{"$f":"Z42-(Z42-AB42)*(AA$41-Z$41)/(AB$41-Z$41)","v":{"v":4.589999999999999,"d":"4.59 m"}},{"v":3.42,"d":"3.42 m"},{"$f":"AB42-(AB42-AD42)*(AC$41-AB$41)/(AD$41-AB$41)","v":{"v":4.409999999999998,"d":"4.41 m"}},{"v":3.31,"d":"3.31 m"},{"$f":"AD42-(AD42-AF42)*(AE$41-AD$41)/(AF$41-AD$41)","v":{"v":4.26,"d":"4.26 m"}},{"v":3.12,"d":"3.12 m"},null,"3b) Verglasung",{"$f":"AI2","v":{"v":1,"d":"1.000"}},null,{"v":0.52,"d":"0.52 kN/qm"},1.18,null,"5772033",{"$f":"AQ42+(AS42-AU42)","v":{"v":6.5,"d":"6.50 m"}},{"$f":"AO42-(AO42-AQ42)*(AP$41-AO$41)/(AQ$41-AO$41)","v":{"v":7.5,"d":"7.50 m"}},{"$f":"AS42+(AS42-AU42)","v":{"v":6,"d":"6.00 m"}},{"$f":"AQ42-(AQ42-AS42)*(AR$41-AQ$41)/(AS$41-AQ$41)","v":{"v":7.5,"d":"7.50 m"}},{"v":5.5,"d":"5.50 m"},{"$f":"AS42-(AS42-AU42)*(AT$41-AS$41)/(AU$41-AS$41)","v":{"v":7.5,"d":"7.50 m"}},{"v":5,"d":"5.00 m"},{"$f":"AU42-(AU42-AW42)*(AV$41-AU$41)/(AW$41-AU$41)","v":{"v":7.1,"d":"7.10 m"}},{"v":4.58,"d":"4.58 m"},{"$f":"AW42-(AW42-AY42)*(AX$41-AW$41)/(AY$41-AW$41)","v":{"v":6.440000000000003,"d":"6.44 m"}},{"v":4.27,"d":"4.27 m"},{"$f":"AY42-(AY42-BA42)*(AZ$41-AY$41)/(BA$41-AY$41)","v":{"v":6.089999999999998,"d":"6.09 m"}},{"v":4.01,"d":"4.01 m"},{"$f":"BA42-(BA42-BC42)*(BB$41-BA$41)/(BC$41-BA$41)","v":{"v":5.769999999999998,"d":"5.77 m"}},{"v":3.79,"d":"3.79 m"},{"$f":"BC42-(BC42-BE42)*(BD$41-BC$41)/(BE$41-BC$41)","v":{"v":5.410000000000002,"d":"5.41 m"}},{"v":3.61,"d":"3.61 m"},{"$f":"BE42-(BE42-BG42)*(BF$41-BE$41)/(BG$41-BE$41)","v":{"v":5.109999999999999,"d":"5.11 m"}},{"v":3.31,"d":"3.31 m"},null,"3c) Verglasung",{"$f":"BJ2","v":{"v":1,"d":"1.000"}},{"$nulls":4},"5772033",{"$f":"BR42+(BT42-BV42)","v":{"v":7.36,"d":"7.36 m"}},{"$f":"BP42-(BP42-BR42)*(BQ$41-BP$41)/(BR$41-BP$41)","v":{"v":8.600000000000001,"d":"8.60 m"}},{"$f":"BT42+(BT42-BV42)","v":{"v":6.74,"d":"6.74 m"}},{"$f":"BR42-(BR42-BT42)*(BS$41-BR$41)/(BT$41-BR$41)","v":{"v":8.600000000000001,"d":"8.60 m"}},{"v":6.12,"d":"6.12 m"},{"$f":"BT42-(BT42-BV42)*(BU$41-BT$41)/(BV$41-BT$41)","v":{"v":8.600000000000001,"d":"8.60 m"}},{"v":5.5,"d":"5.50 m"},{"$f":"BV42-(BV42-BX42)*(BW$41-BV$41)/(BX$41-BV$41)","v":{"v":7.849999999999999,"d":"7.85 m"}},{"v":5.03,"d":"5.03 m"},{"$f":"BX42-(BX42-BZ42)*(BY$41-BX$41)/(BZ$41-BX$41)","v":{"v":7.190000000000002,"d":"7.19 m"}},{"v":4.67,"d":"4.67 m"},{"$f":"BZ42-(BZ42-CB42)*(CA$41-BZ$41)/(CB$41-BZ$41)","v":{"v":6.769999999999999,"d":"6.77 m"}},{"v":4.37,"d":"4.37 m"},{"$f":"CB42-(CB42-CD42)*(CC$41-CB$41)/(CD$41-CB$41)","v":{"v":6.290000000000002,"d":"6.29 m"}},{"v":4.13,"d":"4.13 m"},{"$f":"CD42-(CD42-CF42)*(CE$41-CD$41)/(CF$41-CD$41)","v":{"v":6.02,"d":"6.02 m"}},{"v":3.92,"d":"3.92 m"},{"$f":"CF42-(CF42-CH42)*(CG$41-CF$41)/(CH$41-CF$41)","v":{"v":5.619999999999999,"d":"5.62 m"}},{"v":3.58,"d":"3.58 m"}]
[null,"max. Trägerlänge la",null,{"v":3.1,"d":"3.10  m"},null,null,"3a) Schnee",{"$f":"VLOOKUP($D$6,J42:K54,2)","v":0.982},null,{"$f":"IF(AND($D$6>J42,$D$6<J44),$D$6,\"nicht interpolieren\")","v":"nicht interpolieren"},{"$f":"K42-(K42-K44)*(J43-J42)/(J44-J42)","v":{"$error":"#VALUE!"}},null,"5772033+100*20*3",{"$f":"P43+(R43-T43)","v":{"v":5.43,"d":"5.43 m"}},{"v":6.029999999999999,"d":"6.03 m"},{"$f":"R43+(R43-T43)","v":{"v":5.13,"d":"5.13 m"}},{"v":6.029999999999999,"d":"6.03 m"},{"v":4.83,"d":"4.83 m"},{"v":6.029999999999999,"d":"6.03 m"},{"v":4.53,"d":"4.53 m"},{"v":5.730000000000001,"d":"5.73 m"},{"v":4.29,"d":"4.29 m"},{"v":5.430000000000002,"d":"5.43 m"},{"v":4.1,"d":"4.10 m"},{"v":5.289999999999996,"d":"5.29 m"},{"v":3.93,"d":"3.93 m"},{"v":5.050000000000001,"d":"5.05 m"},{"v":3.79,"d":"3.79 m"},{"v":4.870000000000001,"d":"4.87 m"},{"v":3.67,"d":"3.67 m"},{"v":4.669999999999998,"d":"4.67 m"},{"v":3.47,"d":"3.47 m"},null,"3b) Schnee",{"$f":"VLOOKUP($D$6,AK42:AL54,2)","v":0.974},null,{"$f":"IF(AND($D$6>AK42,$D$6<AK44),$D$6,\"nicht interpolieren\")","v":"nicht interpolieren"},{"$f":"AL42-(AL42-AL44)*(AK43-AK42)/(AK44-AK42)","v":{"$error":"#VALUE!"}},null,"5772033+100*20*3",{"$f":"AQ43+(AS43-AU43)","v":{"v":7.139999999999999,"d":"7.14 m"}},{"v":8.259999999999998,"d":"8.26 m"},{"$f":"AS43+(AS43-AU43)","v":{"v":6.579999999999999,"d":"6.58 m"}},{"v":8.259999999999998,"d":"8.26 m"},{"v":6.02,"d":"6.02 m"},{"v":8.259999999999998,"d":"8.26 m"},{"v":5.46,"d":"5.46 m"},{"v":7.6099999999999985,"d":"7.61 m"},{"v":5.03,"d":"5.03 m"},{"v":7.010000000000001,"d":"7.01 m"},{"v":4.7,"d":"4.70 m"},{"v":6.660000000000002,"d":"6.66 m"},{"v":4.42,"d":"4.42 m"},{"v":6.340000000000002,"d":"6.34 m"},{"v":4.18,"d":"4.18 m"},{"v":5.979999999999997,"d":"5.98 m"},{"v":3.98,"d":"3.98 m"},{"v":5.630000000000001,"d":"5.63 m"},{"v":3.65,"d":"3.65 m"},null,"3c) Schnee",{"$f":"BJ3","v":{"v":10000,"d":"10000.000"}},{"$nulls":4},"5772033+100*20*3",{"$f":"BR43+(BT43-BV43)","v":{"v":8.04,"d":"8.04 m"}},{"v":9.379999999999997,"d":"9.38 m"},{"$f":"BT43+(BT43-BV43)","v":{"v":7.37,"d":"7.37 m"}},{"v":9.379999999999999,"d":"9.38 m"},{"v":6.7,"d":"6.70 m"},{"v":9.379999999999999,"d":"9.38 m"},{"v":6.03,"d":"6.03 m"},{"v":8.530000000000001,"d":"8.53 m"},{"v":5.53,"d":"5.53 m"},{"v":7.870000000000004,"d":"7.87 m"},{"v":5.14,"d":"5.14 m"},{"v":7.3799999999999955,"d":"7.38 m"},{"v":4.82,"d":"4.82 m"},{"v":6.980000000000004,"d":"6.98 m"},{"v":4.55,"d":"4.55 m"},{"v":6.529999999999998,"d":"6.53 m"},{"v":4.33,"d":"4.33 m"},{"v":6.180000000000001,"d":"6.18 m"},{"v":3.96,"d":"3.96 m"}]
[null,"max. Trägerlänge l",null,{"v":3.1,"d":"3.10  m"},{"$f":"IF(D44<D43,\"Achtung: l >= la sein\",\"\")","v":""},null,"3a) Wind",{"$f":"VLOOKUP($D$8,Daten!$A$50:$E$58,5)","v":{"v":1,"d":"1.000"}},null,{"v":0.75,"d":"0.75 kN/qm"},1.05,null,"5772033+100*20*3+120*10",{"v":6.2,"d":"6.20 m"},{"v":6.86,"d":"6.86 m"},{"v":5.87,"d":"5.87 m"},{"v":6.86,"d":"6.86 m"},{"v":5.54,"d":"5.54 m"},{"v":6.86,"d":"6.86 m"},{"v":5.21,"d":"5.21 m"},{"v":6.559999999999998,"d":"6.56 m"},{"v":4.94,"d":"4.94 m"},{"v":6.260000000000004,"d":"6.26 m"},{"v":4.72,"d":"4.72 m"},{"v":5.979999999999998,"d":"5.98 m"},{"v":4.54,"d":"4.54 m"},{"v":5.820000000000001,"d":"5.82 m"},{"v":4.38,"d":"4.38 m"},{"v":5.639999999999997,"d":"5.64 m"},{"v":4.24,"d":"4.24 m"},{"v":5.340000000000003,"d":"5.34 m"},{"v":4.02,"d":"4.02 m"},null,"3b) Wind",{"$f":"VLOOKUP($D$8,Daten!$A$50:$F$58,6)","v":{"v":1,"d":"1.000"}},null,{"v":0.75,"d":"0.75 kN/qm"},1.08,null,"5772033+100*20*3+120*10",{"v":8.21,"d":"8.21 m"},{"v":9.450000000000003,"d":"9.45 m"},{"v":7.59,"d":"7.59 m"},{"v":9.45,"d":"9.45 m"},{"v":6.97,"d":"6.97 m"},{"v":9.45,"d":"9.45 m"},{"v":6.35,"d":"6.35 m"},{"v":8.749999999999996,"d":"8.75 m"},{"v":5.87,"d":"5.87 m"},{"v":8.149999999999999,"d":"8.15 m"},{"v":5.49,"d":"5.49 m"},{"v":7.730000000000002,"d":"7.73 m"},{"v":5.17,"d":"5.17 m"},{"v":7.3299999999999965,"d":"7.33 m"},{"v":4.9,"d":"4.90 m"},{"v":6.970000000000004,"d":"6.97 m"},{"v":4.67,"d":"4.67 m"},{"v":6.569999999999999,"d":"6.57 m"},{"v":4.29,"d":"4.29 m"},null,"3c) Wind",{"$f":"BJ4","v":{"v":1,"d":"1.000"}},{"$nulls":4},"5772033+100*20*3+120*10",{"v":9.280000000000001,"d":"9.28 m"},{"v":10.780000000000001,"d":"10.78 m"},{"v":8.530000000000001,"d":"8.53 m"},{"v":10.780000000000005,"d":"10.78 m"},{"v":7.78,"d":"7.78 m"},{"v":10.780000000000001,"d":"10.78 m"},{"v":7.03,"d":"7.03 m"},{"v":9.830000000000002,"d":"9.83 m"},{"v":6.47,"d":"6.47 m"},{"v":9.170000000000002,"d":"9.17 m"},{"v":6.02,"d":"6.02 m"},{"v":8.609999999999994,"d":"8.61 m"},{"v":5.65,"d":"5.65 m"},{"v":8.130000000000004,"d":"8.13 m"},{"v":5.34,"d":"5.34 m"},{"v":7.679999999999998,"d":"7.68 m"},{"v":5.08,"d":"5.08 m"},{"v":7.18,"d":"7.18 m"},{"v":4.66,"d":"4.66 m"}]
[null,"Gratsparren","=","579504/5 + 100x20",null,null,"3a) Dachneigung",{"$f":"VLOOKUP($D$9,J57:K62,2)","v":{"v":1,"d":"1.000"}},null,{"$f":"IF(AND($D$6>J44,$D$6<J46),$D$6,\"nicht interpolieren\")","v":"nicht interpolieren"},{"$f":"K44-(K44-K46)*(J45-J44)/(J46-J44)","v":{"$error":"#VALUE!"}},null,"577207",{"v":4.5600000000000005,"d":"4.56 m"},{"v":5.08,"d":"5.08 m"},{"v":4.300000000000001,"d":"4.30 m"},{"v":5.080000000000003,"d":"5.08 m"},{"v":4.04,"d":"4.04 m"},{"v":5.080000000000001,"d":"5.08 m"},{"v":3.78,"d":"3.78 m"},{"v":4.7799999999999985,"d":"4.78 m"},{"v":3.58,"d":"3.58 m"},{"v":4.6,"d":"4.60 m"},{"v":3.41,"d":"3.41 m"},{"v":4.390000000000001,"d":"4.39 m"},{"v":3.27,"d":"3.27 m"},{"v":4.23,"d":"4.23 m"},{"v":3.15,"d":"3.15 m"},{"v":4.050000000000001,"d":"4.05 m"},{"v":3.05,"d":"3.05 m"},{"v":3.8999999999999995,"d":"3.90 m"},{"v":2.88,"d":"2.88 m"},null,"3b) Dachneigung",{"$f":"VLOOKUP($D$9,AH57:AI62,2)","v":{"v":1,"d":"1.000"}},null,{"$f":"IF(AND($D$6>AK44,$D$6<AK46),$D$6,\"nicht interpolieren\")","v":"nicht interpolieren"},{"$f":"AL44-(AL44-AL46)*(AK45-AK44)/(AK46-AK44)","v":{"$error":"#VALUE!"}},null,"577207",{"v":5.680000000000001,"d":"5.68 m"},{"v":6.580000000000001,"d":"6.58 m"},{"v":5.23,"d":"5.23 m"},{"v":6.580000000000001,"d":"6.58 m"},{"v":4.78,"d":"4.78 m"},{"v":6.580000000000001,"d":"6.58 m"},{"v":4.33,"d":"4.33 m"},{"v":6.08,"d":"6.08 m"},{"v":3.98,"d":"3.98 m"},{"v":5.6,"d":"5.60 m"},{"v":3.71,"d":"3.71 m"},{"v":5.32,"d":"5.32 m"},{"v":3.48,"d":"3.48 m"},{"v":5,"d":"5.00 m"},{"v":3.29,"d":"3.29 m"},{"v":4.730000000000001,"d":"4.73 m"},{"v":3.13,"d":"3.13 m"},{"v":4.429999999999999,"d":"4.43 m"},{"v":2.87,"d":"2.87 m"},null,"3c) Dachneigung",{"$f":"BJ5","v":{"v":1,"d":"1.000"}},{"$nulls":4},"577207",{"v":6.420000000000002,"d":"6.42 m"},{"v":7.520000000000003,"d":"7.52 m"},{"v":5.870000000000001,"d":"5.87 m"},{"v":7.520000000000003,"d":"7.52 m"},{"v":5.32,"d":"5.32 m"},{"v":7.520000000000003,"d":"7.52 m"},{"v":4.77,"d":"4.77 m"},{"v":6.769999999999997,"d":"6.77 m"},{"v":4.37,"d":"4.37 m"},{"v":6.290000000000002,"d":"6.29 m"},{"v":4.05,"d":"4.05 m"},{"v":5.8,"d":"5.80 m"},{"v":3.8,"d":"3.80 m"},{"v":5.559999999999998,"d":"5.56 m"},{"v":3.58,"d":"3.58 m"},{"v":5.200000000000001,"d":"5.20 m"},{"v":3.4,"d":"3.40 m"},{"v":4.85,"d":"4.85 m"},{"v":3.11,"d":"3.11 m"}]
[null,{"$f":"D44","v":{"v":3.1,"d":"3.10 m"}},{"$f":"IF(B46<D46,\"<\",\">\")","v":"<"},{"$f":"MIN(H99,AI99,BK97)","v":{"v":3.854831020939829,"d":"3.85 m"}},null,null,"3a) Faktor Trägergewicht",{"$f":"IF(AND($D$12<0.8,OR($D$11=$M$2,$D$11=$M$6,$D$11=$M$8,$D$11=$M$10,$D$11=$M$13)),0.99,IF(AND($D$12>=0.8,OR($D$11=$M$3,$D$11=$M$4,$D$11=$M$5,$D$11=$M$7,$D$11=$M$9,$D$11=$M$11,$D$11=$M$12,$D$11=$M$14)),0.97,IF(AND($D$12<0.8,OR($D$11=$M$3,$D$11=$M$4,$D$11=$M$5,$D$11=$M$7,$D$11=$M$9,$D$11=$M$11,$D$11=$M$12,$D$11=$M$14)),0.95,1)))","v":{"v":0.99,"d":"0.990"}},null,{"v":1,"d":"1.00 kN/qm"},{"v":1,"d":"1.00"},null,"577207+110*15",{"v":5.740000000000001,"d":"5.74 m"},{"v":6.360000000000002,"d":"6.36 m"},{"v":5.430000000000001,"d":"5.43 m"},{"v":6.360000000000002,"d":"6.36 m"},{"v":5.12,"d":"5.12 m"},{"v":6.360000000000002,"d":"6.36 m"},{"v":4.81,"d":"4.81 m"},{"v":6.06,"d":"6.06 m"},{"v":4.56,"d":"4.56 m"},{"v":5.759999999999995,"d":"5.76 m"},{"v":4.36,"d":"4.36 m"},{"v":5.55,"d":"5.55 m"},{"v":4.19,"d":"4.19 m"},{"v":5.390000000000003,"d":"5.39 m"},{"v":4.04,"d":"4.04 m"},{"v":5.120000000000001,"d":"5.12 m"},{"v":3.92,"d":"3.92 m"},{"v":5.019999999999999,"d":"5.02 m"},{"v":3.7,"d":"3.70 m"},null,"3b) Faktor Trägergewicht",{"$f":"IF(AND($D$12<0.8,OR($D$11=$M$2,$D$11=$M$6,$D$11=$M$8,$D$11=$M$10,$D$11=$M$13)),0.98,IF(AND($D$12>=0.8,OR($D$11=$M$3,$D$11=$M$4,$D$11=$M$5,$D$11=$M$7,$D$11=$M$9,$D$11=$M$11,$D$11=$M$12,$D$11=$M$14)),0.96,IF(AND($D$12<0.8,OR($D$11=$M$3,$D$11=$M$4,$D$11=$M$5,$D$11=$M$7,$D$11=$M$9,$D$11=$M$11,$D$11=$M$12,$D$11=$M$14)),0.93,1)))","v":{"v":0.98,"d":"0.980"}},null,{"v":1,"d":"1.00 kN/qm"},{"v":1,"d":"1.00"},null,"577207+110*15",{"v":7.389999999999999,"d":"7.39 m"},{"v":8.509999999999998,"d":"8.51 m"},{"v":6.829999999999999,"d":"6.83 m"},{"v":8.509999999999998,"d":"8.51 m"},{"v":6.27,"d":"6.27 m"},{"v":8.509999999999998,"d":"8.51 m"},{"v":5.71,"d":"5.71 m"},{"v":7.910000000000002,"d":"7.91 m"},{"v":5.27,"d":"5.27 m"},{"v":7.309999999999999,"d":"7.31 m"},{"v":4.93,"d":"4.93 m"},{"v":6.96,"d":"6.96 m"},{"v":4.64,"d":"4.64 m"},{"v":6.559999999999994,"d":"6.56 m"},{"v":4.4,"d":"4.40 m"},{"v":6.29,"d":"6.29 m"},{"v":4.19,"d":"4.19 m"},{"v":5.890000000000002,"d":"5.89 m"},{"v":3.85,"d":"3.85 m"},null,"3c) Faktor Trägergewicht",{"$f":"IF(AND($D$12<0.8,OR($D$11=$M$2,$D$11=$M$6,$D$11=$M$8,$D$11=$M$10,$D$11=$M$13)),0.99,IF(AND($D$12>=0.8,OR($D$11=$M$3,$D$11=$M$4,$D$11=$M$5,$D$11=$M$7,$D$11=$M$9,$D$11=$M$11,$D$11=$M$12,$D$11=$M$14)),0.97,IF(AND($D$12<0.8,OR($D$11=$M$3,$D$11=$M$4,$D$11=$M$5,$D$11=$M$7,$D$11=$M$9,$D$11=$M$11,$D$11=$M$12,$D$11=$M$14)),0.94,1)))","v":{"v":0.99,"d":"0.990"}},{"$nulls":4},"577207+110*15",{"v":8.36,"d":"8.36 m"},{"v":9.719999999999999,"d":"9.72 m"},{"v":7.68,"d":"7.68 m"},{"v":9.719999999999999,"d":"9.72 m"},{"v":7,"d":"7.00 m"},{"v":9.719999999999999,"d":"9.72 m"},{"v":6.32,"d":"6.32 m"},{"v":8.920000000000002,"d":"8.92 m"},{"v":5.8,"d":"5.80 m"},{"v":8.199999999999996,"d":"8.20 m"},{"v":5.4,"d":"5.40 m"},{"v":7.710000000000001,"d":"7.71 m"},{"v":5.07,"d":"5.07 m"},{"v":7.310000000000002,"d":"7.31 m"},{"v":4.79,"d":"4.79 m"},{"v":6.860000000000004,"d":"6.86 m"},{"v":4.56,"d":"4.56 m"},{"v":6.509999999999998,"d":"6.51 m"},{"v":4.17,"d":"4.17 m"}]
[{"$nulls":3},{"$f":"IF(B46>D46,\"Bedingung nicht erfüllt!\",\"Bedingung erfüllt!\")","v":"Bedingung erfüllt!"},null,null,"3a) zul. Durchbiegung",{"$f":"VLOOKUP($D$27,Daten!$A$44:$B$47,2)","v":0.873},null,{"$f":"IF(AND($D$6>J46,$D$6<J48),$D$6,\"nicht interpolieren\")","v":{"v":1.1,"d":"1.10 kN/qm"}},{"$f":"K46-(K46-K48)*(J47-J46)/(J48-J46)","v":{"v":0.982,"d":"0.98"}},null,"577276",{"v":6.58,"d":"6.58 m"},{"v":7.34,"d":"7.34 m"},{"v":6.2,"d":"6.20 m"},{"v":7.34,"d":"7.34 m"},{"v":5.82,"d":"5.82 m"},{"v":7.34,"d":"7.34 m"},{"v":5.44,"d":"5.44 m"},{"v":6.890000000000001,"d":"6.89 m"},{"v":5.15,"d":"5.15 m"},{"v":6.590000000000002,"d":"6.59 m"},{"v":4.91,"d":"4.91 m"},{"v":6.310000000000001,"d":"6.31 m"},{"v":4.71,"d":"4.71 m"},{"v":6.069999999999999,"d":"6.07 m"},{"v":4.54,"d":"4.54 m"},{"v":5.890000000000003,"d":"5.89 m"},{"v":4.39,"d":"4.39 m"},{"v":5.64,"d":"5.64 m"},{"v":4.14,"d":"4.14 m"},null,"3b) zul. Durchbiegung",{"$f":"VLOOKUP($D$27,Daten!$A$44:$B$47,2)","v":0.873},null,{"$f":"IF(AND($D$6>AK46,$D$6<AK48),$D$6,\"nicht interpolieren\")","v":{"v":1.1,"d":"1.10 kN/qm"}},{"$f":"AL46-(AL46-AL48)*(AK47-AK46)/(AK48-AK46)","v":{"v":0.974,"d":"0.97"}},null,"577276",{"v":8.200000000000001,"d":"8.20 m"},{"v":9.500000000000002,"d":"9.50 m"},{"v":7.550000000000001,"d":"7.55 m"},{"v":9.500000000000002,"d":"9.50 m"},{"v":6.9,"d":"6.90 m"},{"v":9.500000000000002,"d":"9.50 m"},{"v":6.25,"d":"6.25 m"},{"v":8.75,"d":"8.75 m"},{"v":5.75,"d":"5.75 m"},{"v":8.150000000000002,"d":"8.15 m"},{"v":5.35,"d":"5.35 m"},{"v":7.589999999999995,"d":"7.59 m"},{"v":5.03,"d":"5.03 m"},{"v":7.190000000000004,"d":"7.19 m"},{"v":4.76,"d":"4.76 m"},{"v":6.829999999999996,"d":"6.83 m"},{"v":4.53,"d":"4.53 m"},{"v":6.43,"d":"6.43 m"},{"v":4.15,"d":"4.15 m"},null,"3c) zul. Durchbiegung",{"$f":"VLOOKUP($D$27,Daten!$A$44:$B$47,2)","v":0.873},{"$nulls":4},"577276",{"v":9.259999999999998,"d":"9.26 m"},{"v":10.839999999999996,"d":"10.84 m"},{"v":8.469999999999999,"d":"8.47 m"},{"v":10.839999999999996,"d":"10.84 m"},{"v":7.68,"d":"7.68 m"},{"v":10.84,"d":"10.84 m"},{"v":6.89,"d":"6.89 m"},{"v":9.79,"d":"9.79 m"},{"v":6.31,"d":"6.31 m"},{"v":9.07,"d":"9.07 m"},{"v":5.85,"d":"5.85 m"},{"v":8.439999999999994,"d":"8.44 m"},{"v":5.48,"d":"5.48 m"},{"v":7.880000000000006,"d":"7.88 m"},{"v":5.18,"d":"5.18 m"},{"v":7.609999999999996,"d":"7.61 m"},{"v":4.91,"d":"4.91 m"},{"v":7.01,"d":"7.01 m"},{"v":4.49,"d":"4.49 m"}]
[{"$nulls":9},{"v":1.5,"d":"1.50 kN/qm"},0.91,null,"577276+140*40*3",{"v":7.470000000000001,"d":"7.47 m"},{"v":8.290000000000001,"d":"8.29 m"},{"v":7.0600000000000005,"d":"7.06 m"},{"v":8.290000000000001,"d":"8.29 m"},{"v":6.65,"d":"6.65 m"},{"v":8.290000000000001,"d":"8.29 m"},{"v":6.24,"d":"6.24 m"},{"v":7.890000000000001,"d":"7.89 m"},{"v":5.91,"d":"5.91 m"},{"v":7.469999999999999,"d":"7.47 m"},{"v":5.65,"d":"5.65 m"},{"v":7.260000000000003,"d":"7.26 m"},{"v":5.42,"d":"5.42 m"},{"v":6.939999999999996,"d":"6.94 m"},{"v":5.23,"d":"5.23 m"},{"v":6.760000000000008,"d":"6.76 m"},{"v":5.06,"d":"5.06 m"},{"v":6.459999999999996,"d":"6.46 m"},{"v":4.78,"d":"4.78 m"},{"$nulls":4},{"v":1.5,"d":"1.50 kN/qm"},0.87,null,"577276+140*40*3",{"v":9.720000000000002,"d":"9.72 m"},{"v":11.220000000000002,"d":"11.22 m"},{"v":8.970000000000002,"d":"8.97 m"},{"v":11.220000000000008,"d":"11.22 m"},{"v":8.22,"d":"8.22 m"},{"v":11.220000000000004,"d":"11.22 m"},{"v":7.47,"d":"7.47 m"},{"v":10.370000000000001,"d":"10.37 m"},{"v":6.89,"d":"6.89 m"},{"v":9.649999999999999,"d":"9.65 m"},{"v":6.43,"d":"6.43 m"},{"v":9.09,"d":"9.09 m"},{"v":6.05,"d":"6.05 m"},{"v":8.609999999999996,"d":"8.61 m"},{"v":5.73,"d":"5.73 m"},{"v":8.250000000000004,"d":"8.25 m"},{"v":5.45,"d":"5.45 m"},{"v":7.650000000000002,"d":"7.65 m"},{"v":5.01,"d":"5.01 m"},{"$nulls":7},"577276+140*40*3",{"v":10.950000000000001,"d":"10.95 m"},{"v":12.750000000000002,"d":"12.75 m"},{"v":10.05,"d":"10.05 m"},{"v":12.750000000000002,"d":"12.75 m"},{"v":9.15,"d":"9.15 m"},{"v":12.750000000000002,"d":"12.75 m"},{"v":8.25,"d":"8.25 m"},{"v":11.649999999999999,"d":"11.65 m"},{"v":7.57,"d":"7.57 m"},{"v":10.750000000000002,"d":"10.75 m"},{"v":7.04,"d":"7.04 m"},{"v":10.120000000000003,"d":"10.12 m"},{"v":6.6,"d":"6.60 m"},{"v":9.479999999999995,"d":"9.48 m"},{"v":6.24,"d":"6.24 m"},{"v":9.030000000000005,"d":"9.03 m"},{"v":5.93,"d":"5.93 m"},{"v":8.43,"d":"8.43 m"},{"v":5.43,"d":"5.43 m"}]
[{"$nulls":6},"3a) Erhöhungsfaktor ke aufgrund x-Feldbalken",{"$f":"VLOOKUP($B$32,Daten!$A$104:$B$110,2)","v":1.34},null,{"$f":"IF(AND(D$6>J48,$D$6<J50),$D$6,\"nicht interpolieren\")","v":"nicht interpolieren"},{"$f":"K48-(K48-K50)*(J49-J48)/(J50-J48)","v":{"$error":"#VALUE!"}},null,"577276+140*40*5",{"v":7.77,"d":"7.77 m"},{"v":8.61,"d":"8.61 m"},{"v":7.35,"d":"7.35 m"},{"v":8.61,"d":"8.61 m"},{"v":6.93,"d":"6.93 m"},{"v":8.61,"d":"8.61 m"},{"v":6.51,"d":"6.51 m"},{"v":8.16,"d":"8.16 m"},{"v":6.18,"d":"6.18 m"},{"v":7.859999999999996,"d":"7.86 m"},{"v":5.9,"d":"5.90 m"},{"v":7.510000000000003,"d":"7.51 m"},{"v":5.67,"d":"5.67 m"},{"v":7.270000000000001,"d":"7.27 m"},{"v":5.47,"d":"5.47 m"},{"v":6.999999999999999,"d":"7.00 m"},{"v":5.3,"d":"5.30 m"},{"v":6.75,"d":"6.75 m"},{"v":5.01,"d":"5.01 m"},{"$nulls":4},{"$f":"IF(AND(AA$9>AK48,$D$6<AK50),$D$6,\"nicht interpolieren\")","v":"nicht interpolieren"},{"$f":"AL48-(AL48-AL50)*(AK49-AK48)/(AK50-AK48)","v":{"$error":"#VALUE!"}},null,"577276+140*40*5",{"v":10.329999999999998,"d":"10.33 m"},{"v":11.909999999999997,"d":"11.91 m"},{"v":9.54,"d":"9.54 m"},{"v":11.909999999999997,"d":"11.91 m"},{"v":8.75,"d":"8.75 m"},{"v":11.91,"d":"11.91 m"},{"v":7.96,"d":"7.96 m"},{"v":11.010000000000002,"d":"11.01 m"},{"v":7.35,"d":"7.35 m"},{"v":10.229999999999997,"d":"10.23 m"},{"v":6.87,"d":"6.87 m"},{"v":9.670000000000002,"d":"9.67 m"},{"v":6.47,"d":"6.47 m"},{"v":9.189999999999998,"d":"9.19 m"},{"v":6.13,"d":"6.13 m"},{"v":8.74,"d":"8.74 m"},{"v":5.84,"d":"5.84 m"},{"v":8.239999999999998,"d":"8.24 m"},{"v":5.36,"d":"5.36 m"},{"$nulls":7},"577276+140*40*5",{"v":11.629999999999999,"d":"11.63 m"},{"v":13.509999999999998,"d":"13.51 m"},{"v":10.69,"d":"10.69 m"},{"v":13.509999999999998,"d":"13.51 m"},{"v":9.75,"d":"9.75 m"},{"v":13.509999999999998,"d":"13.51 m"},{"v":8.81,"d":"8.81 m"},{"v":12.410000000000004,"d":"12.41 m"},{"v":8.09,"d":"8.09 m"},{"v":11.510000000000002,"d":"11.51 m"},{"v":7.52,"d":"7.52 m"},{"v":10.739999999999998,"d":"10.74 m"},{"v":7.06,"d":"7.06 m"},{"v":10.099999999999998,"d":"10.10 m"},{"v":6.68,"d":"6.68 m"},{"v":9.65,"d":"9.65 m"},{"v":6.35,"d":"6.35 m"},{"v":8.999999999999996,"d":"9.00 m"},{"v":5.82,"d":"5.82 m"}]
[{"$nulls":9},{"v":2,"d":"2.00 kN/qm"},0.85,null,"579226",{"$f":"P50+(R50-T50)","v":{"v":4.33,"d":"4.33 m"}},{"v":4.8100000000000005,"d":"4.81 m"},{"v":4.09,"d":"4.09 m"},{"v":4.809999999999999,"d":"4.81 m"},{"v":3.85,"d":"3.85 m"},{"v":4.8100000000000005,"d":"4.81 m"},{"v":3.61,"d":"3.61 m"},{"v":4.6099999999999985,"d":"4.61 m"},{"v":3.41,"d":"3.41 m"},{"v":4.370000000000001,"d":"4.37 m"},{"v":3.25,"d":"3.25 m"},{"v":4.159999999999999,"d":"4.16 m"},{"v":3.12,"d":"3.12 m"},{"v":4.000000000000003,"d":"4.00 m"},{"v":3.01,"d":"3.01 m"},{"v":3.9099999999999966,"d":"3.91 m"},{"v":2.91,"d":"2.91 m"},{"v":3.710000000000001,"d":"3.71 m"},{"v":2.75,"d":"2.75 m"},{"$nulls":4},{"v":2,"d":"2.00 kN/qm"},0.78,null,"579226",{"v":5.200000000000001,"d":"5.20 m"},{"v":6.040000000000001,"d":"6.04 m"},{"v":4.780000000000001,"d":"4.78 m"},{"v":6.040000000000004,"d":"6.04 m"},{"v":4.36,"d":"4.36 m"},{"v":6.040000000000002,"d":"6.04 m"},{"v":3.94,"d":"3.94 m"},{"v":5.49,"d":"5.49 m"},{"v":3.63,"d":"3.63 m"},{"v":5.13,"d":"5.13 m"},{"v":3.38,"d":"3.38 m"},{"v":4.85,"d":"4.85 m"},{"v":3.17,"d":"3.17 m"},{"v":4.529999999999999,"d":"4.53 m"},{"v":3,"d":"3.00 m"},{"v":4.260000000000002,"d":"4.26 m"},{"v":2.86,"d":"2.86 m"},{"v":4.059999999999999,"d":"4.06 m"},{"v":2.62,"d":"2.62 m"},{"$nulls":7},"579226",{"v":5.82,"d":"5.82 m"},{"v":6.800000000000001,"d":"6.80 m"},{"v":5.33,"d":"5.33 m"},{"v":6.800000000000001,"d":"6.80 m"},{"v":4.84,"d":"4.84 m"},{"v":6.800000000000001,"d":"6.80 m"},{"v":4.35,"d":"4.35 m"},{"v":6.1999999999999975,"d":"6.20 m"},{"v":3.98,"d":"3.98 m"},{"v":5.720000000000001,"d":"5.72 m"},{"v":3.69,"d":"3.69 m"},{"v":5.3,"d":"5.30 m"},{"v":3.46,"d":"3.46 m"},{"v":4.9799999999999995,"d":"4.98 m"},{"v":3.27,"d":"3.27 m"},{"v":4.799999999999999,"d":"4.80 m"},{"v":3.1,"d":"3.10 m"},{"v":4.45,"d":"4.45 m"},{"v":2.83,"d":"2.83 m"}]
[{"$nulls":9},{"$f":"IF(AND($D$6>J50,$D$6<J52),$D$6,\"nicht interpolieren\")","v":"nicht interpolieren"},{"$f":"K50-(K50-K52)*(J51-J50)/(J52-J50)","v":{"$error":"#VALUE!"}},null,"579226+100*50*4",{"v":5.46,"d":"5.46 m"},{"$f":"N51-(N51-P51)*(O$41-N$41)/(P$41-N$41)","v":{"v":6.04,"d":"6.04 m"}},{"$f":"R51+(R51-T51)","v":{"v":5.17,"d":"5.17 m"}},{"$f":"P51-(P51-R51)*(Q$41-P$41)/(R$41-P$41)","v":{"v":6.04,"d":"6.04 m"}},{"v":4.88,"d":"4.88 m"},{"$f":"R51-(R51-T51)*(S$41-R$41)/(T$41-R$41)","v":{"v":6.04,"d":"6.04 m"}},{"v":4.59,"d":"4.59 m"},{"$f":"T51-(T51-V51)*(U$41-T$41)/(V$41-T$41)","v":{"v":5.790000000000001,"d":"5.79 m"}},{"v":4.35,"d":"4.35 m"},{"$f":"V51-(V51-X51)*(W$41-V$41)/(X$41-V$41)","v":{"v":5.549999999999995,"d":"5.55 m"}},{"v":4.15,"d":"4.15 m"},{"$f":"X51-(X51-Z51)*(Y$41-X$41)/(Z$41-X$41)","v":{"v":5.270000000000001,"d":"5.27 m"}},{"v":3.99,"d":"3.99 m"},{"$f":"Z51-(Z51-AB51)*(AA$41-Z$41)/(AB$41-Z$41)","v":{"v":5.110000000000001,"d":"5.11 m"}},{"v":3.85,"d":"3.85 m"},{"$f":"AB51-(AB51-AD51)*(AC$41-AB$41)/(AD$41-AB$41)","v":{"v":4.9300000000000015,"d":"4.93 m"}},{"v":3.73,"d":"3.73 m"},{"$f":"AD51-(AD51-AF51)*(AE$41-AD$41)/(AF$41-AD$41)","v":{"v":4.779999999999999,"d":"4.78 m"}},{"v":3.52,"d":"3.52 m"},{"$nulls":4},{"$f":"IF(AND($D$6>AK50,$D$6<AK52),$D$6,\"nicht interpolieren\")","v":"nicht interpolieren"},{"$f":"AL50-(AL50-AL52)*(AK51-AK50)/(AK52-AK50)","v":{"$error":"#VALUE!"}},null,"579226+100*50*4",{"v":7.210000000000002,"d":"7.21 m"},{"v":8.310000000000002,"d":"8.31 m"},{"$f":"AS51+(AS51-AU51)","v":{"v":6.660000000000001,"d":"6.66 m"}},{"v":8.310000000000002,"d":"8.31 m"},{"v":6.11,"d":"6.11 m"},{"v":8.310000000000002,"d":"8.31 m"},{"v":5.56,"d":"5.56 m"},{"v":7.709999999999998,"d":"7.71 m"},{"v":5.13,"d":"5.13 m"},{"v":7.169999999999999,"d":"7.17 m"},{"v":4.79,"d":"4.79 m"},{"v":6.750000000000002,"d":"6.75 m"},{"v":4.51,"d":"4.51 m"},{"v":6.4300000000000015,"d":"6.43 m"},{"v":4.27,"d":"4.27 m"},{"v":6.069999999999993,"d":"6.07 m"},{"v":4.07,"d":"4.07 m"},{"v":5.720000000000001,"d":"5.72 m"},{"v":3.74,"d":"3.74 m"},{"$nulls":7},"579226+100*50*4",{"v":8.129999999999999,"d":"8.13 m"},{"v":9.45,"d":"9.45 m"},{"$f":"BT51+(BT51-BV51)","v":{"v":7.469999999999999,"d":"7.47 m"}},{"v":9.449999999999996,"d":"9.45 m"},{"v":6.81,"d":"6.81 m"},{"v":9.449999999999996,"d":"9.45 m"},{"v":6.15,"d":"6.15 m"},{"v":8.700000000000003,"d":"8.70 m"},{"v":5.64,"d":"5.64 m"},{"v":7.979999999999998,"d":"7.98 m"},{"v":5.25,"d":"5.25 m"},{"v":7.5600000000000005,"d":"7.56 m"},{"v":4.92,"d":"4.92 m"},{"v":7.0799999999999965,"d":"7.08 m"},{"v":4.65,"d":"4.65 m"},{"v":6.720000000000004,"d":"6.72 m"},{"v":4.42,"d":"4.42 m"},{"v":6.2700000000000005,"d":"6.27 m"},{"v":4.05,"d":"4.05 m"}]
[{"$nulls":6},"3a) Tabellenwert l",{"$f":"O59","v":{"v":3.25,"d":"3.25 m"}},null,{"v":2.5,"d":"2.50 kN/qm"},{"v":0.8,"d":"0.80"},null,"579226+100*50*6,3",{"v":5.799999999999999,"d":"5.80 m"},{"v":6.419999999999998,"d":"6.42 m"},{"$f":"R52+(R52-T52)","v":{"v":5.489999999999999,"d":"5.49 m"}},{"$f":"P52-(P52-R52)*(Q$41-P$41)/(R$41-P$41)","v":{"v":6.419999999999998,"d":"6.42 m"}},{"v":5.18,"d":"5.18 m"},{"$f":"R52-(R52-T52)*(S$41-R$41)/(T$41-R$41)","v":{"v":6.419999999999998,"d":"6.42 m"}},{"v":4.87,"d":"4.87 m"},{"$f":"T52-(T52-V52)*(U$41-T$41)/(V$41-T$41)","v":{"v":6.12,"d":"6.12 m"}},{"v":4.62,"d":"4.62 m"},{"$f":"V52-(V52-X52)*(W$41-V$41)/(X$41-V$41)","v":{"v":5.820000000000001,"d":"5.82 m"}},{"v":4.42,"d":"4.42 m"},{"$f":"X52-(X52-Z52)*(Y$41-X$41)/(Z$41-X$41)","v":{"v":5.679999999999998,"d":"5.68 m"}},{"v":4.24,"d":"4.24 m"},{"$f":"Z52-(Z52-AB52)*(AA$41-Z$41)/(AB$41-Z$41)","v":{"v":5.360000000000005,"d":"5.36 m"}},{"v":4.1,"d":"4.10 m"},{"$f":"AB52-(AB52-AD52)*(AC$41-AB$41)/(AD$41-AB$41)","v":{"v":5.269999999999994,"d":"5.27 m"}},{"v":3.97,"d":"3.97 m"},{"$f":"AD52-(AD52-AF52)*(AE$41-AD$41)/(AF$41-AD$41)","v":{"v":5.070000000000001,"d":"5.07 m"}},{"v":3.75,"d":"3.75 m"},null,"3b) Tabellenwert l",{"$f":"AP59","v":{"v":3.38,"d":"3.38 m"}},null,{"v":2.5,"d":"2.50 kN/qm"},0.72,null,"579226+100*50*6,3",{"$f":"AQ52+(AS52-AU52)","v":{"v":7.8900000000000015,"d":"7.89 m"}},{"$f":"AO52-(AO52-AQ52)*(AP$41-AO$41)/(AQ$41-AO$41)","v":{"v":9.090000000000003,"d":"9.09 m"}},{"$f":"AS52+(AS52-AU52)","v":{"v":7.290000000000001,"d":"7.29 m"}},{"$f":"AQ52-(AQ52-AS52)*(AR$41-AQ$41)/(AS$41-AQ$41)","v":{"v":9.090000000000003,"d":"9.09 m"}},{"v":6.69,"d":"6.69 m"},{"$f":"AS52-(AS52-AU52)*(AT$41-AS$41)/(AU$41-AS$41)","v":{"v":9.090000000000003,"d":"9.09 m"}},{"v":6.09,"d":"6.09 m"},{"$f":"AU52-(AU52-AW52)*(AV$41-AU$41)/(AW$41-AU$41)","v":{"v":8.39,"d":"8.39 m"}},{"v":5.63,"d":"5.63 m"},{"$f":"AW52-(AW52-AY52)*(AX$41-AW$41)/(AY$41-AW$41)","v":{"v":7.8500000000000005,"d":"7.85 m"}},{"v":5.26,"d":"5.26 m"},{"$f":"AY52-(AY52-BA52)*(AZ$41-AY$41)/(BA$41-AY$41)","v":{"v":7.3599999999999985,"d":"7.36 m"}},{"v":4.96,"d":"4.96 m"},{"$f":"BA52-(BA52-BC52)*(BB$41-BA$41)/(BC$41-BA$41)","v":{"v":7.039999999999998,"d":"7.04 m"}},{"v":4.7,"d":"4.70 m"},{"$f":"BC52-(BC52-BE52)*(BD$41-BC$41)/(BE$41-BC$41)","v":{"v":6.679999999999998,"d":"6.68 m"}},{"v":4.48,"d":"4.48 m"},{"$f":"BE52-(BE52-BG52)*(BF$41-BE$41)/(BG$41-BE$41)","v":{"v":6.330000000000001,"d":"6.33 m"}},{"v":4.11,"d":"4.11 m"},null,"3c) Tabellenwert l",{"$f":"BQ59","v":{"v":3.69,"d":"3.69 m"}},{"$nulls":4},"579226+100*50*6,3",{"$f":"BR52+(BT52-BV52)","v":{"v":8.899999999999999,"d":"8.90 m"}},{"$f":"BP52-(BP52-BR52)*(BQ$41-BP$41)/(BR$41-BP$41)","v":{"v":10.339999999999996,"d":"10.34 m"}},{"$f":"BT52+(BT52-BV52)","v":{"v":8.18,"d":"8.18 m"}},{"$f":"BR52-(BR52-BT52)*(BS$41-BR$41)/(BT$41-BR$41)","v":{"v":10.34,"d":"10.34 m"}},{"v":7.46,"d":"7.46 m"},{"$f":"BT52-(BT52-BV52)*(BU$41-BT$41)/(BV$41-BT$41)","v":{"v":10.34,"d":"10.34 m"}},{"v":6.74,"d":"6.74 m"},{"$f":"BV52-(BV52-BX52)*(BW$41-BV$41)/(BX$41-BV$41)","v":{"v":9.440000000000001,"d":"9.44 m"}},{"v":6.2,"d":"6.20 m"},{"$f":"BX52-(BX52-BZ52)*(BY$41-BX$41)/(BZ$41-BX$41)","v":{"v":8.780000000000005,"d":"8.78 m"}},{"v":5.77,"d":"5.77 m"},{"$f":"BZ52-(BZ52-CB52)*(CA$41-BZ$41)/(CB$41-BZ$41)","v":{"v":8.219999999999997,"d":"8.22 m"}},{"v":5.42,"d":"5.42 m"},{"$f":"CB52-(CB52-CD52)*(CC$41-CB$41)/(CD$41-CB$41)","v":{"v":7.8199999999999985,"d":"7.82 m"}},{"v":5.12,"d":"5.12 m"},{"$f":"CD52-(CD52-CF52)*(CE$41-CD$41)/(CF$41-CD$41)","v":{"v":7.37,"d":"7.37 m"}},{"v":4.87,"d":"4.87 m"},{"$f":"CF52-(CF52-CH52)*(CG$41-CF$41)/(CH$41-CF$41)","v":{"v":6.920000000000001,"d":"6.92 m"}},{"v":4.46,"d":"4.46 m"}]
[{"$nulls":6},"3a) Korrigierter lzul1",{"$f":"H52*H42*H43*H44*H45*H46*H47","v":{"v":2.758317705,"d":"2.76 m"}},null,{"$f":"IF(AND($D$6>J52,$D$6<J54),$D$6,\"nicht interpolieren\")","v":"nicht interpolieren"},{"$f":"K52-(K52-K54)*(J53-J52)/(J54-J52)","v":{"$error":"#VALUE!"}},null,"579227",{"v":3.4000000000000004,"d":"3.40 m"},{"v":3.8000000000000007,"d":"3.80 m"},{"$f":"R53+(R53-T53)","v":{"v":3.2,"d":"3.20 m"}},{"$f":"P53-(P53-R53)*(Q$41-P$41)/(R$41-P$41)","v":{"v":3.8000000000000007,"d":"3.80 m"}},{"v":3,"d":"3.00 m"},{"$f":"R53-(R53-T53)*(S$41-R$41)/(T$41-R$41)","v":{"v":3.8000000000000007,"d":"3.80 m"}},{"v":2.8,"d":"2.80 m"},{"$f":"T53-(T53-V53)*(U$41-T$41)/(V$41-T$41)","v":{"v":3.5499999999999994,"d":"3.55 m"}},{"v":2.65,"d":"2.65 m"},{"$f":"V53-(V53-X53)*(W$41-V$41)/(X$41-V$41)","v":{"v":3.3700000000000006,"d":"3.37 m"}},{"v":2.53,"d":"2.53 m"},{"$f":"X53-(X53-Z53)*(Y$41-X$41)/(Z$41-X$41)","v":{"v":3.299999999999999,"d":"3.30 m"}},{"v":2.42,"d":"2.42 m"},{"$f":"Z53-(Z53-AB53)*(AA$41-Z$41)/(AB$41-Z$41)","v":{"v":3.0600000000000005,"d":"3.06 m"}},{"v":2.34,"d":"2.34 m"},{"$f":"AB53-(AB53-AD53)*(AC$41-AB$41)/(AD$41-AB$41)","v":{"v":3.0600000000000005,"d":"3.06 m"}},{"v":2.26,"d":"2.26 m"},{"$f":"AD53-(AD53-AF53)*(AE$41-AD$41)/(AF$41-AD$41)","v":{"v":2.9099999999999993,"d":"2.91 m"}},{"v":2.13,"d":"2.13 m"},null,"3b) Korrigierter lzul1",{"$f":"AI52*AI42*AI43*AI44*AI45*AI46*AI47","v":{"v":2.8165403447999995,"d":"2.82 m"}},null,{"$f":"IF(AND($D$6>AK52,$D$6<AK54),$D$6,\"nicht interpolieren\")","v":"nicht interpolieren"},{"$f":"AL52-(AL52-AL54)*(AK53-AK52)/(AK54-AK52)","v":{"$error":"#VALUE!"}},null,"579227",{"$f":"AQ53+(AS53-AU53)","v":{"v":3.9799999999999995,"d":"3.98 m"}},{"$f":"AO53-(AO53-AQ53)*(AP$41-AO$41)/(AQ$41-AO$41)","v":{"v":4.619999999999999,"d":"4.62 m"}},{"$f":"AS53+(AS53-AU53)","v":{"v":3.6599999999999997,"d":"3.66 m"}},{"$f":"AQ53-(AQ53-AS53)*(AR$41-AQ$41)/(AS$41-AQ$41)","v":{"v":4.619999999999999,"d":"4.62 m"}},{"v":3.34,"d":"3.34 m"},{"$f":"AS53-(AS53-AU53)*(AT$41-AS$41)/(AU$41-AS$41)","v":{"v":4.619999999999999,"d":"4.62 m"}},{"v":3.02,"d":"3.02 m"},{"$f":"AU53-(AU53-AW53)*(AV$41-AU$41)/(AW$41-AU$41)","v":{"v":4.220000000000001,"d":"4.22 m"}},{"v":2.78,"d":"2.78 m"},{"$f":"AW53-(AW53-AY53)*(AX$41-AW$41)/(AY$41-AW$41)","v":{"v":3.9199999999999995,"d":"3.92 m"}},{"v":2.59,"d":"2.59 m"},{"$f":"AY53-(AY53-BA53)*(AZ$41-AY$41)/(BA$41-AY$41)","v":{"v":3.7099999999999977,"d":"3.71 m"}},{"v":2.43,"d":"2.43 m"},{"$f":"BA53-(BA53-BC53)*(BB$41-BA$41)/(BC$41-BA$41)","v":{"v":3.470000000000003,"d":"3.47 m"}},{"v":2.3,"d":"2.30 m"},{"$f":"BC53-(BC53-BE53)*(BD$41-BC$41)/(BE$41-BC$41)","v":{"v":3.379999999999997,"d":"3.38 m"}},{"v":2.18,"d":"2.18 m"},{"$f":"BE53-(BE53-BG53)*(BF$41-BE$41)/(BG$41-BE$41)","v":{"v":3.080000000000001,"d":"3.08 m"}},{"v":2,"d":"2.00 m"},null,"3c) Korrigierter lzul1",{"$f":"BJ52*BJ42*BJ43*BJ44*BJ45*BJ46*BJ47","v":{"v":31891.563,"d":"31,891.56 m"}},{"$nulls":4},"579227",{"$f":"BR53+(BT53-BV53)","v":{"v":4.47,"d":"4.47 m"}},{"$f":"BP53-(BP53-BR53)*(BQ$41-BP$41)/(BR$41-BP$41)","v":{"v":5.2299999999999995,"d":"5.23 m"}},{"$f":"BT53+(BT53-BV53)","v":{"v":4.09,"d":"4.09 m"}},{"$f":"BR53-(BR53-BT53)*(BS$41-BR$41)/(BT$41-BR$41)","v":{"v":5.2299999999999995,"d":"5.23 m"}},{"v":3.71,"d":"3.71 m"},{"$f":"BT53-(BT53-BV53)*(BU$41-BT$41)/(BV$41-BT$41)","v":{"v":5.2299999999999995,"d":"5.23 m"}},{"v":3.33,"d":"3.33 m"},{"$f":"BV53-(BV53-BX53)*(BW$41-BV$41)/(BX$41-BV$41)","v":{"v":4.730000000000001,"d":"4.73 m"}},{"v":3.05,"d":"3.05 m"},{"$f":"BX53-(BX53-BZ53)*(BY$41-BX$41)/(BZ$41-BX$41)","v":{"v":4.369999999999998,"d":"4.37 m"}},{"v":2.83,"d":"2.83 m"},{"$f":"BZ53-(BZ53-CB53)*(CA$41-BZ$41)/(CB$41-BZ$41)","v":{"v":4.090000000000002,"d":"4.09 m"}},{"v":2.65,"d":"2.65 m"},{"$f":"CB53-(CB53-CD53)*(CC$41-CB$41)/(CD$41-CB$41)","v":{"v":3.849999999999999,"d":"3.85 m"}},{"v":2.5,"d":"2.50 m"},{"$f":"CD53-(CD53-CF53)*(CE$41-CD$41)/(CF$41-CD$41)","v":{"v":3.669999999999999,"d":"3.67 m"}},{"v":2.37,"d":"2.37 m"},{"$f":"CF53-(CF53-CH53)*(CG$41-CF$41)/(CH$41-CF$41)","v":{"v":3.370000000000001,"d":"3.37 m"}},{"v":2.17,"d":"2.17 m"}]
[{"$nulls":9},{"v":3,"d":"3.00 kN/qm"},0.76,null,"579227+70*50*5",{"v":4.2700000000000005,"d":"4.27 m"},{"v":4.750000000000001,"d":"4.75 m"},{"$f":"R54+(R54-T54)","v":{"v":4.03,"d":"4.03 m"}},{"$f":"P54-(P54-R54)*(Q$41-P$41)/(R$41-P$41)","v":{"v":4.750000000000001,"d":"4.75 m"}},{"v":3.79,"d":"3.79 m"},{"$f":"R54-(R54-T54)*(S$41-R$41)/(T$41-R$41)","v":{"v":4.750000000000001,"d":"4.75 m"}},{"v":3.55,"d":"3.55 m"},{"$f":"T54-(T54-V54)*(U$41-T$41)/(V$41-T$41)","v":{"v":4.449999999999998,"d":"4.45 m"}},{"v":3.37,"d":"3.37 m"},{"$f":"V54-(V54-X54)*(W$41-V$41)/(X$41-V$41)","v":{"v":4.27,"d":"4.27 m"}},{"v":3.22,"d":"3.22 m"},{"$f":"X54-(X54-Z54)*(Y$41-X$41)/(Z$41-X$41)","v":{"v":4.130000000000003,"d":"4.13 m"}},{"v":3.09,"d":"3.09 m"},{"$f":"Z54-(Z54-AB54)*(AA$41-Z$41)/(AB$41-Z$41)","v":{"v":3.969999999999999,"d":"3.97 m"}},{"v":2.98,"d":"2.98 m"},{"$f":"AB54-(AB54-AD54)*(AC$41-AB$41)/(AD$41-AB$41)","v":{"v":3.880000000000001,"d":"3.88 m"}},{"v":2.88,"d":"2.88 m"},{"$f":"AD54-(AD54-AF54)*(AE$41-AD$41)/(AF$41-AD$41)","v":{"v":3.6799999999999984,"d":"3.68 m"}},{"v":2.72,"d":"2.72 m"},{"$nulls":4},{"v":3,"d":"3.00 kN/qm"},0.67,null,"579227+70*50*5",{"v":5.639999999999999,"d":"5.64 m"},{"v":6.519999999999998,"d":"6.52 m"},{"$f":"AS54+(AS54-AU54)","v":{"v":5.199999999999999,"d":"5.20 m"}},{"v":6.519999999999998,"d":"6.52 m"},{"v":4.76,"d":"4.76 m"},{"v":6.519999999999998,"d":"6.52 m"},{"v":4.32,"d":"4.32 m"},{"v":6.020000000000001,"d":"6.02 m"},{"v":3.98,"d":"3.98 m"},{"v":5.539999999999999,"d":"5.54 m"},{"v":3.72,"d":"3.72 m"},{"v":5.260000000000002,"d":"5.26 m"},{"v":3.5,"d":"3.50 m"},{"v":5.02,"d":"5.02 m"},{"v":3.31,"d":"3.31 m"},{"v":4.750000000000002,"d":"4.75 m"},{"v":3.15,"d":"3.15 m"},{"v":4.449999999999999,"d":"4.45 m"},{"v":2.89,"d":"2.89 m"},{"$nulls":7},"579227+70*50*5",{"v":6.36,"d":"6.36 m"},{"v":7.420000000000001,"d":"7.42 m"},{"$f":"BT54+(BT54-BV54)","v":{"v":5.83,"d":"5.83 m"}},{"v":7.420000000000001,"d":"7.42 m"},{"v":5.3,"d":"5.30 m"},{"v":7.420000000000001,"d":"7.42 m"},{"v":4.77,"d":"4.77 m"},{"v":6.719999999999998,"d":"6.72 m"},{"v":4.38,"d":"4.38 m"},{"v":6.2399999999999975,"d":"6.24 m"},{"v":4.07,"d":"4.07 m"},{"v":5.820000000000004,"d":"5.82 m"},{"v":3.82,"d":"3.82 m"},{"v":5.5,"d":"5.50 m"},{"v":3.61,"d":"3.61 m"},{"v":5.229999999999997,"d":"5.23 m"},{"v":3.43,"d":"3.43 m"},{"v":4.880000000000001,"d":"4.88 m"},{"v":3.14,"d":"3.14 m"}]
[{"$nulls":12},"579300",{"v":4.49,"d":"4.49 m"},{"v":5.029999999999999,"d":"5.03 m"},{"$f":"R55+(R55-T55)","v":{"v":4.220000000000001,"d":"4.22 m"}},{"$f":"P55-(P55-R55)*(Q$41-P$41)/(R$41-P$41)","v":{"v":5.030000000000002,"d":"5.03 m"}},{"v":3.95,"d":"3.95 m"},{"$f":"R55-(R55-T55)*(S$41-R$41)/(T$41-R$41)","v":{"v":5.03,"d":"5.03 m"}},{"v":3.68,"d":"3.68 m"},{"$f":"T55-(T55-V55)*(U$41-T$41)/(V$41-T$41)","v":{"v":4.63,"d":"4.63 m"}},{"v":3.49,"d":"3.49 m"},{"$f":"V55-(V55-X55)*(W$41-V$41)/(X$41-V$41)","v":{"v":4.450000000000001,"d":"4.45 m"}},{"v":3.33,"d":"3.33 m"},{"$f":"X55-(X55-Z55)*(Y$41-X$41)/(Z$41-X$41)","v":{"v":4.239999999999999,"d":"4.24 m"}},{"v":3.2,"d":"3.20 m"},{"$f":"Z55-(Z55-AB55)*(AA$41-Z$41)/(AB$41-Z$41)","v":{"v":4.240000000000003,"d":"4.24 m"}},{"v":3.07,"d":"3.07 m"},{"$f":"AB55-(AB55-AD55)*(AC$41-AB$41)/(AD$41-AB$41)","v":{"v":3.9699999999999966,"d":"3.97 m"}},{"v":2.97,"d":"2.97 m"},{"$f":"AD55-(AD55-AF55)*(AE$41-AD$41)/(AF$41-AD$41)","v":{"v":3.820000000000002,"d":"3.82 m"}},{"v":2.8,"d":"2.80 m"},{"$nulls":7},"579300",{"$f":"AQ55+(AS55-AU55)","v":{"v":5.499999999999998,"d":"5.50 m"}},{"$f":"AO55-(AO55-AQ55)*(AP$41-AO$41)/(AQ$41-AO$41)","v":{"v":6.399999999999997,"d":"6.40 m"}},{"$f":"AS55+(AS55-AU55)","v":{"v":5.049999999999999,"d":"5.05 m"}},{"$f":"AQ55-(AQ55-AS55)*(AR$41-AQ$41)/(AS$41-AQ$41)","v":{"v":6.399999999999997,"d":"6.40 m"}},{"v":4.6,"d":"4.60 m"},{"$f":"AS55-(AS55-AU55)*(AT$41-AS$41)/(AU$41-AS$41)","v":{"v":6.399999999999997,"d":"6.40 m"}},{"v":4.15,"d":"4.15 m"},{"$f":"AU55-(AU55-AW55)*(AV$41-AU$41)/(AW$41-AU$41)","v":{"v":5.8000000000000025,"d":"5.80 m"}},{"v":3.82,"d":"3.82 m"},{"$f":"AW55-(AW55-AY55)*(AX$41-AW$41)/(AY$41-AW$41)","v":{"v":5.4399999999999995,"d":"5.44 m"}},{"v":3.55,"d":"3.55 m"},{"$f":"AY55-(AY55-BA55)*(AZ$41-AY$41)/(BA$41-AY$41)","v":{"v":5.02,"d":"5.02 m"}},{"v":3.34,"d":"3.34 m"},{"$f":"BA55-(BA55-BC55)*(BB$41-BA$41)/(BC$41-BA$41)","v":{"v":4.779999999999998,"d":"4.78 m"}},{"v":3.16,"d":"3.16 m"},{"$f":"BC55-(BC55-BE55)*(BD$41-BC$41)/(BE$41-BC$41)","v":{"v":4.600000000000001,"d":"4.60 m"}},{"v":3,"d":"3.00 m"},{"$f":"BE55-(BE55-BG55)*(BF$41-BE$41)/(BG$41-BE$41)","v":{"v":4.200000000000001,"d":"4.20 m"}},{"v":2.76,"d":"2.76 m"},{"$nulls":7},"579300",{"$f":"BR55+(BT55-BV55)","v":{"v":6.150000000000001,"d":"6.15 m"}},{"$f":"BP55-(BP55-BR55)*(BQ$41-BP$41)/(BR$41-BP$41)","v":{"v":7.190000000000002,"d":"7.19 m"}},{"$f":"BT55+(BT55-BV55)","v":{"v":5.630000000000001,"d":"5.63 m"}},{"$f":"BR55-(BR55-BT55)*(BS$41-BR$41)/(BT$41-BR$41)","v":{"v":7.190000000000002,"d":"7.19 m"}},{"v":5.11,"d":"5.11 m"},{"$f":"BT55-(BT55-BV55)*(BU$41-BT$41)/(BV$41-BT$41)","v":{"v":7.190000000000002,"d":"7.19 m"}},{"v":4.59,"d":"4.59 m"},{"$f":"BV55-(BV55-BX55)*(BW$41-BV$41)/(BX$41-BV$41)","v":{"v":6.589999999999997,"d":"6.59 m"}},{"v":4.19,"d":"4.19 m"},{"$f":"BX55-(BX55-BZ55)*(BY$41-BX$41)/(BZ$41-BX$41)","v":{"v":6.050000000000003,"d":"6.05 m"}},{"v":3.88,"d":"3.88 m"},{"$f":"BZ55-(BZ55-CB55)*(CA$41-BZ$41)/(CB$41-BZ$41)","v":{"v":5.559999999999999,"d":"5.56 m"}},{"v":3.64,"d":"3.64 m"},{"$f":"CB55-(CB55-CD55)*(CC$41-CB$41)/(CD$41-CB$41)","v":{"v":5.240000000000002,"d":"5.24 m"}},{"v":3.44,"d":"3.44 m"},{"$f":"CD55-(CD55-CF55)*(CE$41-CD$41)/(CF$41-CD$41)","v":{"v":4.969999999999999,"d":"4.97 m"}},{"v":3.27,"d":"3.27 m"},{"$f":"CF55-(CF55-CH55)*(CG$41-CF$41)/(CH$41-CF$41)","v":{"v":4.669999999999999,"d":"4.67 m"}},{"v":2.99,"d":"2.99 m"}]
[{"$nulls":9},"3a) Dachneigung","3a) k",null,"579300+100*50*4",{"v":5.540000000000002,"d":"5.54 m"},{"v":6.140000000000003,"d":"6.14 m"},{"$f":"R56+(R56-T56)","v":{"v":5.240000000000001,"d":"5.24 m"}},{"$f":"P56-(P56-R56)*(Q$41-P$41)/(R$41-P$41)","v":{"v":6.140000000000003,"d":"6.14 m"}},{"v":4.94,"d":"4.94 m"},{"$f":"R56-(R56-T56)*(S$41-R$41)/(T$41-R$41)","v":{"v":6.140000000000003,"d":"6.14 m"}},{"v":4.64,"d":"4.64 m"},{"$f":"T56-(T56-V56)*(U$41-T$41)/(V$41-T$41)","v":{"v":5.839999999999996,"d":"5.84 m"}},{"v":4.4,"d":"4.40 m"},{"$f":"V56-(V56-X56)*(W$41-V$41)/(X$41-V$41)","v":{"v":5.600000000000001,"d":"5.60 m"}},{"v":4.2,"d":"4.20 m"},{"$f":"X56-(X56-Z56)*(Y$41-X$41)/(Z$41-X$41)","v":{"v":5.39,"d":"5.39 m"}},{"v":4.03,"d":"4.03 m"},{"$f":"Z56-(Z56-AB56)*(AA$41-Z$41)/(AB$41-Z$41)","v":{"v":5.150000000000001,"d":"5.15 m"}},{"v":3.89,"d":"3.89 m"},{"$f":"AB56-(AB56-AD56)*(AC$41-AB$41)/(AD$41-AB$41)","v":{"v":4.970000000000001,"d":"4.97 m"}},{"v":3.77,"d":"3.77 m"},{"$f":"AD56-(AD56-AF56)*(AE$41-AD$41)/(AF$41-AD$41)","v":{"v":4.82,"d":"4.82 m"}},{"v":3.56,"d":"3.56 m"},null,"3b) Dachneigung","3b) k",{"$nulls":4},"579300+100*50*4",{"$f":"AQ56+(AS56-AU56)","v":{"v":7.339999999999999,"d":"7.34 m"}},{"$f":"AO56-(AO56-AQ56)*(AP$41-AO$41)/(AQ$41-AO$41)","v":{"v":8.459999999999997,"d":"8.46 m"}},{"$f":"AS56+(AS56-AU56)","v":{"v":6.779999999999999,"d":"6.78 m"}},{"$f":"AQ56-(AQ56-AS56)*(AR$41-AQ$41)/(AS$41-AQ$41)","v":{"v":8.459999999999997,"d":"8.46 m"}},{"v":6.22,"d":"6.22 m"},{"$f":"AS56-(AS56-AU56)*(AT$41-AS$41)/(AU$41-AS$41)","v":{"v":8.459999999999997,"d":"8.46 m"}},{"v":5.66,"d":"5.66 m"},{"$f":"AU56-(AU56-AW56)*(AV$41-AU$41)/(AW$41-AU$41)","v":{"v":7.860000000000002,"d":"7.86 m"}},{"v":5.22,"d":"5.22 m"},{"$f":"AW56-(AW56-AY56)*(AX$41-AW$41)/(AY$41-AW$41)","v":{"v":7.319999999999998,"d":"7.32 m"}},{"v":4.87,"d":"4.87 m"},{"$f":"AY56-(AY56-BA56)*(AZ$41-AY$41)/(BA$41-AY$41)","v":{"v":6.830000000000002,"d":"6.83 m"}},{"v":4.59,"d":"4.59 m"},{"$f":"BA56-(BA56-BC56)*(BB$41-BA$41)/(BC$41-BA$41)","v":{"v":6.59,"d":"6.59 m"}},{"v":4.34,"d":"4.34 m"},{"$f":"BC56-(BC56-BE56)*(BD$41-BC$41)/(BE$41-BC$41)","v":{"v":6.1400000000000015,"d":"6.14 m"}},{"v":4.14,"d":"4.14 m"},{"$f":"BE56-(BE56-BG56)*(BF$41-BE$41)/(BG$41-BE$41)","v":{"v":5.839999999999999,"d":"5.84 m"}},{"v":3.8,"d":"3.80 m"},{"$nulls":7},"579300+100*50*4",{"$f":"BR56+(BT56-BV56)","v":{"v":8.3,"d":"8.30 m"}},{"$f":"BP56-(BP56-BR56)*(BQ$41-BP$41)/(BR$41-BP$41)","v":{"v":9.66,"d":"9.66 m"}},{"$f":"BT56+(BT56-BV56)","v":{"v":7.620000000000001,"d":"7.62 m"}},{"$f":"BR56-(BR56-BT56)*(BS$41-BR$41)/(BT$41-BR$41)","v":{"v":9.660000000000004,"d":"9.66 m"}},{"v":6.94,"d":"6.94 m"},{"$f":"BT56-(BT56-BV56)*(BU$41-BT$41)/(BV$41-BT$41)","v":{"v":9.660000000000004,"d":"9.66 m"}},{"v":6.26,"d":"6.26 m"},{"$f":"BV56-(BV56-BX56)*(BW$41-BV$41)/(BX$41-BV$41)","v":{"v":8.809999999999999,"d":"8.81 m"}},{"v":5.75,"d":"5.75 m"},{"$f":"BX56-(BX56-BZ56)*(BY$41-BX$41)/(BZ$41-BX$41)","v":{"v":8.21,"d":"8.21 m"}},{"v":5.34,"d":"5.34 m"},{"$f":"BZ56-(BZ56-CB56)*(CA$41-BZ$41)/(CB$41-BZ$41)","v":{"v":7.65,"d":"7.65 m"}},{"v":5.01,"d":"5.01 m"},{"$f":"CB56-(CB56-CD56)*(CC$41-CB$41)/(CD$41-CB$41)","v":{"v":7.249999999999995,"d":"7.25 m"}},{"v":4.73,"d":"4.73 m"},{"$f":"CD56-(CD56-CF56)*(CE$41-CD$41)/(CF$41-CD$41)","v":{"v":6.800000000000004,"d":"6.80 m"}},{"v":4.5,"d":"4.50 m"},{"$f":"CF56-(CF56-CH56)*(CG$41-CF$41)/(CH$41-CF$41)","v":{"v":6.3999999999999995,"d":"6.40 m"}},{"v":4.12,"d":"4.12 m"}]
[{"$nulls":9},{"v":1,"d":"1.00 °"},{"v":1,"d":"1.00"},null,"579300+100*50*6,3",{"v":5.909999999999998,"d":"5.91 m"},{"v":6.549999999999997,"d":"6.55 m"},{"$f":"R57+(R57-T57)","v":{"v":5.589999999999999,"d":"5.59 m"}},{"$f":"P57-(P57-R57)*(Q$41-P$41)/(R$41-P$41)","v":{"v":6.549999999999997,"d":"6.55 m"}},{"v":5.27,"d":"5.27 m"},{"$f":"R57-(R57-T57)*(S$41-R$41)/(T$41-R$41)","v":{"v":6.549999999999997,"d":"6.55 m"}},{"v":4.95,"d":"4.95 m"},{"$f":"T57-(T57-V57)*(U$41-T$41)/(V$41-T$41)","v":{"v":6.249999999999999,"d":"6.25 m"}},{"v":4.69,"d":"4.69 m"},{"$f":"V57-(V57-X57)*(W$41-V$41)/(X$41-V$41)","v":{"v":5.95,"d":"5.95 m"}},{"v":4.48,"d":"4.48 m"},{"$f":"X57-(X57-Z57)*(Y$41-X$41)/(Z$41-X$41)","v":{"v":5.740000000000005,"d":"5.74 m"}},{"v":4.3,"d":"4.30 m"},{"$f":"Z57-(Z57-AB57)*(AA$41-Z$41)/(AB$41-Z$41)","v":{"v":5.499999999999996,"d":"5.50 m"}},{"v":4.15,"d":"4.15 m"},{"$f":"AB57-(AB57-AD57)*(AC$41-AB$41)/(AD$41-AB$41)","v":{"v":5.320000000000007,"d":"5.32 m"}},{"v":4.02,"d":"4.02 m"},{"$f":"AD57-(AD57-AF57)*(AE$41-AD$41)/(AF$41-AD$41)","v":{"v":5.169999999999997,"d":"5.17 m"}},{"v":3.79,"d":"3.79 m"},null,{"v":1,"d":"1.00 °"},{"v":1,"d":"1.00"},{"$nulls":4},"579300+100*50*6,3",{"$f":"AQ57+(AS57-AU57)","v":{"v":8.089999999999998,"d":"8.09 m"}},{"$f":"AO57-(AO57-AQ57)*(AP$41-AO$41)/(AQ$41-AO$41)","v":{"v":9.329999999999997,"d":"9.33 m"}},{"$f":"AS57+(AS57-AU57)","v":{"v":7.469999999999999,"d":"7.47 m"}},{"$f":"AQ57-(AQ57-AS57)*(AR$41-AQ$41)/(AS$41-AQ$41)","v":{"v":9.329999999999997,"d":"9.33 m"}},{"v":6.85,"d":"6.85 m"},{"$f":"AS57-(AS57-AU57)*(AT$41-AS$41)/(AU$41-AS$41)","v":{"v":9.329999999999997,"d":"9.33 m"}},{"v":6.23,"d":"6.23 m"},{"$f":"AU57-(AU57-AW57)*(AV$41-AU$41)/(AW$41-AU$41)","v":{"v":8.630000000000003,"d":"8.63 m"}},{"v":5.75,"d":"5.75 m"},{"$f":"AW57-(AW57-AY57)*(AX$41-AW$41)/(AY$41-AW$41)","v":{"v":8.03,"d":"8.03 m"}},{"v":5.37,"d":"5.37 m"},{"$f":"AY57-(AY57-BA57)*(AZ$41-AY$41)/(BA$41-AY$41)","v":{"v":7.610000000000002,"d":"7.61 m"}},{"v":5.05,"d":"5.05 m"},{"$f":"BA57-(BA57-BC57)*(BB$41-BA$41)/(BC$41-BA$41)","v":{"v":7.209999999999996,"d":"7.21 m"}},{"v":4.78,"d":"4.78 m"},{"$f":"BC57-(BC57-BE57)*(BD$41-BC$41)/(BE$41-BC$41)","v":{"v":6.760000000000006,"d":"6.76 m"}},{"v":4.56,"d":"4.56 m"},{"$f":"BE57-(BE57-BG57)*(BF$41-BE$41)/(BG$41-BE$41)","v":{"v":6.409999999999996,"d":"6.41 m"}},{"v":4.19,"d":"4.19 m"},{"$nulls":7},"579300+100*50*6,3",{"$f":"BR57+(BT57-BV57)","v":{"v":9.159999999999998,"d":"9.16 m"}},{"$f":"BP57-(BP57-BR57)*(BQ$41-BP$41)/(BR$41-BP$41)","v":{"v":10.679999999999998,"d":"10.68 m"}},{"$f":"BT57+(BT57-BV57)","v":{"v":8.399999999999999,"d":"8.40 m"}},{"$f":"BR57-(BR57-BT57)*(BS$41-BR$41)/(BT$41-BR$41)","v":{"v":10.679999999999996,"d":"10.68 m"}},{"v":7.64,"d":"7.64 m"},{"$f":"BT57-(BT57-BV57)*(BU$41-BT$41)/(BV$41-BT$41)","v":{"v":10.68,"d":"10.68 m"}},{"v":6.88,"d":"6.88 m"},{"$f":"BV57-(BV57-BX57)*(BW$41-BV$41)/(BX$41-BV$41)","v":{"v":9.629999999999999,"d":"9.63 m"}},{"v":6.33,"d":"6.33 m"},{"$f":"BX57-(BX57-BZ57)*(BY$41-BX$41)/(BZ$41-BX$41)","v":{"v":9.030000000000001,"d":"9.03 m"}},{"v":5.88,"d":"5.88 m"},{"$f":"BZ57-(BZ57-CB57)*(CA$41-BZ$41)/(CB$41-BZ$41)","v":{"v":8.400000000000002,"d":"8.40 m"}},{"v":5.52,"d":"5.52 m"},{"$f":"CB57-(CB57-CD57)*(CC$41-CB$41)/(CD$41-CB$41)","v":{"v":7.9999999999999964,"d":"8.00 m"}},{"v":5.21,"d":"5.21 m"},{"$f":"CD57-(CD57-CF57)*(CE$41-CD$41)/(CF$41-CD$41)","v":{"v":7.46,"d":"7.46 m"}},{"v":4.96,"d":"4.96 m"},{"$f":"CF57-(CF57-CH57)*(CG$41-CF$41)/(CH$41-CF$41)","v":{"v":7.06,"d":"7.06 m"}},{"v":4.54,"d":"4.54 m"}]
[{"$nulls":9},{"v":10,"d":"10.00 °"},{"v":1,"d":"1.00"},null,"Rinne","Tiefe","b",{"$nulls":18},{"v":10,"d":"10.00 °"},{"v":1,"d":"1.00"},{"$nulls":4},"Rinne","Tiefe","b",{"$nulls":24},"Rinne","Tiefe","b"]
[{"$nulls":9},{"$f":"IF(AND($D$9>J58,$D$9<J60),$D$9,\"nicht interpolieren\")","v":"nicht interpolieren"},{"$f":"K58-(K58-K60)*(J59-J58)/(J60-J58)","v":{"$error":"#VALUE!"}},null,{"$f":"IF($D$26=\"\",\"\",MATCH($D$26,M42:M57))","v":9},{"$f":"IF($D$10=\"\",\"\",MATCH('Ermittlung Schneelast'!$D$19,N41:AF41,0))","v":11},{"$f":"IF(OR($D$26=\"\",$D$25=\"\"),0,INDEX(N42:AF57,M59,N59))","v":{"v":3.25,"d":"3.25 m"}},{"$nulls":18},{"$f":"IF(AND($D$9>AH58,$D$9<AH60),$D$9,\"nicht interpolieren\")","v":"nicht interpolieren"},{"$f":"AI58-(AI58-AI60)*(AH59-AH58)/(AH60-AH58)","v":{"$error":"#VALUE!"}},{"$nulls":4},{"$f":"IF($D$26=\"\",\"\",MATCH($D$26,AN42:AN57))","v":9},{"$f":"IF($D$10=\"\",\"\",MATCH('Ermittlung Schneelast'!$D$19,AO41:BG41,0))","v":11},{"$f":"IF(OR($D$26=\"\",$D$25=\"\"),0,INDEX(AO42:BG57,AN59,AO59))","v":{"v":3.38,"d":"3.38 m"}},{"$nulls":24},{"$f":"IF($D$26=\"\",\"\",MATCH($D$26,BO42:BO57))","v":9},{"$f":"IF($D$10=\"\",\"\",MATCH('Ermittlung Schneelast'!$D$19,BP41:CH41,0))","v":11},{"$f":"IF(OR($D$26=\"\",$D$25=\"\"),0,INDEX(BP42:CH57,BO59,BP59))","v":{"v":3.69,"d":"3.69 m"}}]
[{"$nulls":9},{"v":20,"d":"20.00 °"},{"v":0.97,"d":"0.970"},{"$nulls":22},{"v":20,"d":"20.00 °"},{"v":0.95,"d":"0.950"}]
[{"$nulls":9},{"$f":"IF(AND($D$9>J60,$D$9<J62),$D$9,\"nicht interpolieren\")","v":"nicht interpolieren"},{"$f":"K60-(K60-K62)*(J61-J60)/(J62-J60)","v":{"$error":"#VALUE!"}},{"$nulls":22},{"$f":"IF(AND($D$9>AH60,$D$9<AH62),$D$9,\"nicht interpolieren\")","v":"nicht interpolieren"},{"$f":"AI60-(AI60-AI62)*(AH61-AH60)/(AH62-AH60)","v":{"$error":"#VALUE!"}}]
[{"$nulls":9},{"v":30,"d":"30.00 °"},0.94,{"$nulls":22},{"v":30,"d":"30.00 °"},0.91]
[]
[{"$nulls":66},"Gratsparren",{"v":0.5,"d":"0.50 m"},{"$f":"IF(AND($D$36>0.5,$D$36<0.6),$D$36,0)","v":{"v":0,"d":"0.00 m"}},{"v":0.6,"d":"0.60 m"},{"$f":"IF(AND($D$36>0.6,$D$36<0.7),$D$36,0)","v":{"v":0,"d":"0.00 m"}},{"v":0.7,"d":"0.70 m"},{"$f":"IF(AND($D$36>0.7,$D$36<0.8),$D$36,0)","v":{"v":0,"d":"0.00 m"}},{"v":0.8,"d":"0.80 m"},{"$f":"IF(AND($D$36>0.8,$D$36<0.9),$D$36,0)","v":{"v":0,"d":"0.00 m"}},{"v":0.9,"d":"0.90 m"},{"$f":"IF(AND($D$36>0.9,$D$36<1),$D$36,0)","v":{"v":0,"d":"0.00 m"}},{"v":1,"d":"1.00 m"},{"$f":"IF(AND($D$36>1,$D$36<1.1),$D$36,0)","v":{"v":0,"d":"0.00 m"}},{"v":1.1,"d":"1.10 m"}]
[{"$nulls":6},"4a) Korrekturfaktoren",null,null,"4a) Dachneigung","4a) k",null,"Gratsparren",{"v":0.5,"d":"0.50 m"},{"$f":"IF(AND($D$36>0.5,$D$36<0.6),$D$36,0)","v":{"v":0,"d":"0.00 m"}},{"v":0.6,"d":"0.60 m"},{"$f":"IF(AND($D$36>0.6,$D$36<0.7),$D$36,0)","v":{"v":0,"d":"0.00 m"}},{"v":0.7,"d":"0.70 m"},{"$f":"IF(AND($D$36>0.7,$D$36<0.8),$D$36,0)","v":{"v":0,"d":"0.00 m"}},{"v":0.8,"d":"0.80 m"},{"$f":"IF(AND($D$36>0.8,$D$36<0.9),$D$36,0)","v":{"v":0,"d":"0.00 m"}},{"v":0.9,"d":"0.90 m"},{"$f":"IF(AND($D$36>0.9,$D$36<1),$D$36,0)","v":{"v":0,"d":"0.00 m"}},{"v":1,"d":"1.00 m"},{"$f":"IF(AND($D$36>1,$D$36<1.1),$D$36,0)","v":{"v":0,"d":"0.00 m"}},{"v":1.1,"d":"1.10 m"},{"$nulls":7},"4b)  Korrekturfaktoren",{"$nulls":5},"Gratsparren",{"v":0.5,"d":"0.50 m"},{"$f":"IF(AND($D$36>0.5,$D$36<0.6),$D$36,0)","v":{"v":0,"d":"0.00 m"}},{"v":0.6,"d":"0.60 m"},{"$f":"IF(AND($D$36>0.6,$D$36<0.7),$D$36,0)","v":{"v":0,"d":"0.00 m"}},{"v":0.7,"d":"0.70 m"},{"$f":"IF(AND($D$36>0.7,$D$36<0.8),$D$36,0)","v":{"v":0,"d":"0.00 m"}},{"v":0.8,"d":"0.80 m"},{"$f":"IF(AND($D$36>0.8,$D$36<0.9),$D$36,0)","v":{"v":0,"d":"0.00 m"}},{"v":0.9,"d":"0.90 m"},{"$f":"IF(AND($D$36>0.9,$D$36<1),$D$36,0)","v":{"v":0,"d":"0.00 m"}},{"v":1,"d":"1.00 m"},{"$f":"IF(AND($D$36>1,$D$36<1.1),$D$36,0)","v":{"v":0,"d":"0.00 m"}},{"v":1.1,"d":"1.10 m"},{"$nulls":7},"4c)   Korrekturfaktoren",{"$nulls":5},"577291/2",{"v":8.41,"d":"8.41 m"},{"$f":"BP65-(BP65-BR65)*(BQ$64-BP$64)/(BR$64-BP$64)","v":{"v":11.110000000000001,"d":"11.11 m"}},{"v":7.87,"d":"7.87 m"},{"$f":"BR65-(BR65-BT65)*(BS$64-BR$64)/(BT$64-BR$64)","v":{"v":10.570000000000002,"d":"10.57 m"}},{"v":7.42,"d":"7.42 m"},{"$f":"BT65-(BT65-BV65)*(BU$64-BT$64)/(BV$64-BT$64)","v":{"v":10.149999999999995,"d":"10.15 m"}},{"v":7.03,"d":"7.03 m"},{"$f":"BV65-(BV65-BX65)*(BW$64-BV$64)/(BX$64-BV$64)","v":{"v":9.670000000000002,"d":"9.67 m"}},{"v":6.7,"d":"6.70 m"},{"$f":"BX65-(BX65-BZ65)*(BY$64-BX$64)/(BZ$64-BX$64)","v":{"v":9.310000000000002,"d":"9.31 m"}},{"v":6.41,"d":"6.41 m"},{"$f":"BZ65-(BZ65-CB65)*(CA$64-BZ$64)/(CB$64-BZ$64)","v":{"v":9.110000000000003,"d":"9.11 m"}},{"v":6.14,"d":"6.14 m"}]
[{"$nulls":6},"4a) Verglasung",{"$f":"H2","v":{"v":1,"d":"1.000"}},null,{"v":1,"d":"1.00 °"},{"v":1,"d":"1.00"},null,"577291/2",{"v":4.92,"d":"4.92 m"},{"$f":"N66-(N66-P66)*(O$65-N$65)/(P$65-N$65)","v":{"v":6.069999999999998,"d":"6.07 m"}},{"v":4.69,"d":"4.69 m"},{"$f":"P66-(P66-R66)*(Q$65-P$65)/(R$65-P$65)","v":{"v":5.830000000000003,"d":"5.83 m"}},{"v":4.5,"d":"4.50 m"},{"$f":"R66-(R66-T66)*(S$65-R$65)/(T$65-R$65)","v":{"v":5.689999999999999,"d":"5.69 m"}},{"v":4.33,"d":"4.33 m"},{"$f":"T66-(T66-V66)*(U$65-T$65)/(V$65-T$65)","v":{"v":5.610000000000001,"d":"5.61 m"}},{"v":4.17,"d":"4.17 m"},{"$f":"V66-(V66-X66)*(W$65-V$65)/(X$65-V$65)","v":{"v":5.429999999999998,"d":"5.43 m"}},{"v":4.03,"d":"4.03 m"},{"$f":"X66-(X66-Z66)*(Y$65-X$65)/(Z$65-X$65)","v":{"v":5.330000000000003,"d":"5.33 m"}},{"v":3.9,"d":"3.90 m"},{"$nulls":7},"4b)  Verglasung",{"$f":"AI2","v":{"v":1,"d":"1.000"}},{"$nulls":4},"577291/2",{"v":7.63,"d":"7.63 m"},{"$f":"AO66-(AO66-AQ66)*(AP$65-AO$65)/(AQ$65-AO$65)","v":{"v":10.080000000000002,"d":"10.08 m"}},{"v":7.14,"d":"7.14 m"},{"$f":"AQ66-(AQ66-AS66)*(AR$65-AQ$65)/(AS$65-AQ$65)","v":{"v":9.599999999999996,"d":"9.60 m"}},{"v":6.73,"d":"6.73 m"},{"$f":"AS66-(AS66-AU66)*(AT$65-AS$65)/(AU$65-AS$65)","v":{"v":9.180000000000001,"d":"9.18 m"}},{"v":6.38,"d":"6.38 m"},{"$f":"AU66-(AU66-AW66)*(AV$65-AU$65)/(AW$65-AU$65)","v":{"v":8.859999999999998,"d":"8.86 m"}},{"v":6.07,"d":"6.07 m"},{"$f":"AW66-(AW66-AY66)*(AX$65-AW$65)/(AY$65-AW$65)","v":{"v":8.500000000000005,"d":"8.50 m"}},{"v":5.8,"d":"5.80 m"},{"$f":"AY66-(AY66-BA66)*(AZ$65-AY$65)/(BA$65-AY$65)","v":{"v":8.099999999999993,"d":"8.10 m"}},{"v":5.57,"d":"5.57 m"},{"$nulls":7},"4c)   Verglasung",{"$f":"BJ2","v":{"v":1,"d":"1.000"}},{"$nulls":4},"577293/4",{"v":8.63,"d":"8.63 m"},{"$f":"BP66-(BP66-BR66)*(BQ$64-BP$64)/(BR$64-BP$64)","v":{"v":11.380000000000004,"d":"11.38 m"}},{"v":8.08,"d":"8.08 m"},{"$f":"BR66-(BR66-BT66)*(BS$64-BR$64)/(BT$64-BR$64)","v":{"v":10.84,"d":"10.84 m"}},{"v":7.62,"d":"7.62 m"},{"$f":"BT66-(BT66-BV66)*(BU$64-BT$64)/(BV$64-BT$64)","v":{"v":10.349999999999994,"d":"10.35 m"}},{"v":7.23,"d":"7.23 m"},{"$f":"BV66-(BV66-BX66)*(BW$64-BV$64)/(BX$64-BV$64)","v":{"v":9.950000000000006,"d":"9.95 m"}},{"v":6.89,"d":"6.89 m"},{"$f":"BX66-(BX66-BZ66)*(BY$64-BX$64)/(BZ$64-BX$64)","v":{"v":9.59,"d":"9.59 m"}},{"v":6.59,"d":"6.59 m"},{"$f":"BZ66-(BZ66-CB66)*(CA$64-BZ$64)/(CB$64-BZ$64)","v":{"v":9.289999999999994,"d":"9.29 m"}},{"v":6.32,"d":"6.32 m"}]
[{"$nulls":6},"4a) Schnee",{"$f":"H3","v":0.982},null,{"v":10,"d":"10.00 °"},{"v":1,"d":"1.00"},null,"577293/4",{"v":5.15,"d":"5.15 m"},{"$f":"N67-(N67-P67)*(O$65-N$65)/(P$65-N$65)","v":{"v":6.2500000000000036,"d":"6.25 m"}},{"v":4.93,"d":"4.93 m"},{"$f":"P67-(P67-R67)*(Q$65-P$65)/(R$65-P$65)","v":{"v":6.1299999999999955,"d":"6.13 m"}},{"v":4.73,"d":"4.73 m"},{"$f":"R67-(R67-T67)*(S$65-R$65)/(T$65-R$65)","v":{"v":5.920000000000005,"d":"5.92 m"}},{"v":4.56,"d":"4.56 m"},{"$f":"T67-(T67-V67)*(U$65-T$65)/(V$65-T$65)","v":{"v":5.759999999999995,"d":"5.76 m"}},{"v":4.41,"d":"4.41 m"},{"$f":"V67-(V67-X67)*(W$65-V$65)/(X$65-V$65)","v":{"v":5.760000000000003,"d":"5.76 m"}},{"v":4.26,"d":"4.26 m"},{"$f":"X67-(X67-Z67)*(Y$65-X$65)/(Z$65-X$65)","v":{"v":5.559999999999998,"d":"5.56 m"}},{"v":4.13,"d":"4.13 m"},{"$nulls":7},"4b)  Schnee",{"$f":"AI3","v":0.972},{"$nulls":4},"577293/4",{"v":7.83,"d":"7.83 m"},{"$f":"AO67-(AO67-AQ67)*(AP$65-AO$65)/(AQ$65-AO$65)","v":{"v":10.33,"d":"10.33 m"}},{"v":7.33,"d":"7.33 m"},{"$f":"AQ67-(AQ67-AS67)*(AR$65-AQ$65)/(AS$65-AQ$65)","v":{"v":9.85,"d":"9.85 m"}},{"v":6.91,"d":"6.91 m"},{"$f":"AS67-(AS67-AU67)*(AT$65-AS$65)/(AU$65-AS$65)","v":{"v":9.43,"d":"9.43 m"}},{"v":6.55,"d":"6.55 m"},{"$f":"AU67-(AU67-AW67)*(AV$65-AU$65)/(AW$65-AU$65)","v":{"v":9.029999999999998,"d":"9.03 m"}},{"v":6.24,"d":"6.24 m"},{"$f":"AW67-(AW67-AY67)*(AX$65-AW$65)/(AY$65-AW$65)","v":{"v":8.670000000000005,"d":"8.67 m"}},{"v":5.97,"d":"5.97 m"},{"$f":"AY67-(AY67-BA67)*(AZ$65-AY$65)/(BA$65-AY$65)","v":{"v":8.36999999999999,"d":"8.37 m"}},{"v":5.73,"d":"5.73 m"},{"$nulls":7},"4c)   Schnee",{"$f":"BJ3","v":{"v":10000,"d":"10000.000"}},{"$nulls":4},"577293/4 + 70x30x3",{"v":10.33,"d":"10.33 m"},{"$f":"BP67-(BP67-BR67)*(BQ$64-BP$64)/(BR$64-BP$64)","v":{"v":13.329999999999998,"d":"13.33 m"}},{"v":9.73,"d":"9.73 m"},{"$f":"BR67-(BR67-BT67)*(BS$64-BR$64)/(BT$64-BR$64)","v":{"v":12.73,"d":"12.73 m"}},{"v":9.23,"d":"9.23 m"},{"$f":"BT67-(BT67-BV67)*(BU$64-BT$64)/(BV$64-BT$64)","v":{"v":12.239999999999995,"d":"12.24 m"}},{"v":8.8,"d":"8.80 m"},{"$f":"BV67-(BV67-BX67)*(BW$64-BV$64)/(BX$64-BV$64)","v":{"v":11.840000000000007,"d":"11.84 m"}},{"v":8.42,"d":"8.42 m"},{"$f":"BX67-(BX67-BZ67)*(BY$64-BX$64)/(BZ$64-BX$64)","v":{"v":11.48,"d":"11.48 m"}},{"v":8.08,"d":"8.08 m"},{"$f":"BZ67-(BZ67-CB67)*(CA$64-BZ$64)/(CB$64-BZ$64)","v":{"v":11.079999999999995,"d":"11.08 m"}},{"v":7.78,"d":"7.78 m"}]
[{"$nulls":6},"4a) Wind",{"$f":"H4","v":{"v":1,"d":"1.000"}},null,{"$f":"IF(AND($D$9>J67,$D$9<J69),$D$9,\"nicht interpolieren\")","v":"nicht interpolieren"},{"$f":"K67-(K67-K69)*(J68-J67)/(J69-J67)","v":{"$error":"#VALUE!"}},null,"577293/4 + 70x30x3",{"v":5.75,"d":"5.75 m"},{"$f":"N68-(N68-P68)*(O$65-N$65)/(P$65-N$65)","v":{"v":6.849999999999999,"d":"6.85 m"}},{"v":5.53,"d":"5.53 m"},{"$f":"P68-(P68-R68)*(Q$65-P$65)/(R$65-P$65)","v":{"v":6.730000000000001,"d":"6.73 m"}},{"v":5.33,"d":"5.33 m"},{"$f":"R68-(R68-T68)*(S$65-R$65)/(T$65-R$65)","v":{"v":6.519999999999999,"d":"6.52 m"}},{"v":5.16,"d":"5.16 m"},{"$f":"T68-(T68-V68)*(U$65-T$65)/(V$65-T$65)","v":{"v":6.440000000000001,"d":"6.44 m"}},{"v":5,"d":"5.00 m"},{"$f":"V68-(V68-X68)*(W$65-V$65)/(X$65-V$65)","v":{"v":6.259999999999998,"d":"6.26 m"}},{"v":4.86,"d":"4.86 m"},{"$f":"X68-(X68-Z68)*(Y$65-X$65)/(Z$65-X$65)","v":{"v":6.260000000000005,"d":"6.26 m"}},{"v":4.72,"d":"4.72 m"},{"$nulls":7},"4b)  Wind",{"$f":"AI4","v":{"v":1,"d":"1.000"}},{"$nulls":4},"577293/4 + 70x30x3",{"v":9.3,"d":"9.30 m"},{"$f":"AO68-(AO68-AQ68)*(AP$65-AO$65)/(AQ$65-AO$65)","v":{"v":11.900000000000007,"d":"11.90 m"}},{"v":8.78,"d":"8.78 m"},{"$f":"AQ68-(AQ68-AS68)*(AR$65-AQ$65)/(AS$65-AQ$65)","v":{"v":11.479999999999995,"d":"11.48 m"}},{"v":8.33,"d":"8.33 m"},{"$f":"AS68-(AS68-AU68)*(AT$65-AS$65)/(AU$65-AS$65)","v":{"v":11.059999999999995,"d":"11.06 m"}},{"v":7.94,"d":"7.94 m"},{"$f":"AU68-(AU68-AW68)*(AV$65-AU$65)/(AW$65-AU$65)","v":{"v":10.660000000000007,"d":"10.66 m"}},{"v":7.6,"d":"7.60 m"},{"$f":"AW68-(AW68-AY68)*(AX$65-AW$65)/(AY$65-AW$65)","v":{"v":10.389999999999997,"d":"10.39 m"}},{"v":7.29,"d":"7.29 m"},{"$f":"AY68-(AY68-BA68)*(AZ$65-AY$65)/(BA$65-AY$65)","v":{"v":9.990000000000002,"d":"9.99 m"}},{"v":7.02,"d":"7.02 m"},{"$nulls":7},"4c)   Wind",{"$f":"BJ4","v":{"v":1,"d":"1.000"}},{"$nulls":4},"577297/8",{"v":6.25,"d":"6.25 m"},{"$f":"BP68-(BP68-BR68)*(BQ$64-BP$64)/(BR$64-BP$64)","v":{"v":8.3,"d":"8.30 m"}},{"v":5.84,"d":"5.84 m"},{"$f":"BR68-(BR68-BT68)*(BS$64-BR$64)/(BT$64-BR$64)","v":{"v":7.879999999999999,"d":"7.88 m"}},{"v":5.5,"d":"5.50 m"},{"$f":"BT68-(BT68-BV68)*(BU$64-BT$64)/(BV$64-BT$64)","v":{"v":7.5299999999999985,"d":"7.53 m"}},{"v":5.21,"d":"5.21 m"},{"$f":"BV68-(BV68-BX68)*(BW$64-BV$64)/(BX$64-BV$64)","v":{"v":7.210000000000001,"d":"7.21 m"}},{"v":4.96,"d":"4.96 m"},{"$f":"BX68-(BX68-BZ68)*(BY$64-BX$64)/(BZ$64-BX$64)","v":{"v":7.029999999999996,"d":"7.03 m"}},{"v":4.73,"d":"4.73 m"},{"$f":"BZ68-(BZ68-CB68)*(CA$64-BZ$64)/(CB$64-BZ$64)","v":{"v":6.73,"d":"6.73 m"}},{"v":4.53,"d":"4.53 m"}]
[{"$nulls":6},"4a) Dachneigung",{"$f":"VLOOKUP($D$9,J66:K71,2)","v":{"v":1,"d":"1.000"}},null,{"v":20,"d":"20.00 °"},{"v":0.98,"d":"0.980"},null,"577297/8",{"v":3.55,"d":"3.55 m"},{"$f":"N69-(N69-P69)*(O$65-N$65)/(P$65-N$65)","v":{"v":4.449999999999998,"d":"4.45 m"}},{"v":3.37,"d":"3.37 m"},{"$f":"P69-(P69-R69)*(Q$65-P$65)/(R$65-P$65)","v":{"v":4.27,"d":"4.27 m"}},{"v":3.22,"d":"3.22 m"},{"$f":"R69-(R69-T69)*(S$65-R$65)/(T$65-R$65)","v":{"v":4.2,"d":"4.20 m"}},{"v":3.08,"d":"3.08 m"},{"$f":"T69-(T69-V69)*(U$65-T$65)/(V$65-T$65)","v":{"v":4.119999999999999,"d":"4.12 m"}},{"v":2.95,"d":"2.95 m"},{"$f":"V69-(V69-X69)*(W$65-V$65)/(X$65-V$65)","v":{"v":4.030000000000001,"d":"4.03 m"}},{"v":2.83,"d":"2.83 m"},{"$f":"X69-(X69-Z69)*(Y$65-X$65)/(Z$65-X$65)","v":{"v":3.929999999999998,"d":"3.93 m"}},{"v":2.72,"d":"2.72 m"},{"$nulls":7},"4b)  Dachneigung",{"v":1,"d":"1.000"},{"$nulls":4},"577297/8",{"v":5.65,"d":"5.65 m"},{"$f":"AO69-(AO69-AQ69)*(AP$65-AO$65)/(AQ$65-AO$65)","v":{"v":7.500000000000002,"d":"7.50 m"}},{"v":5.28,"d":"5.28 m"},{"$f":"AQ69-(AQ69-AS69)*(AR$65-AQ$65)/(AS$65-AQ$65)","v":{"v":7.079999999999999,"d":"7.08 m"}},{"v":4.98,"d":"4.98 m"},{"$f":"AS69-(AS69-AU69)*(AT$65-AS$65)/(AU$65-AS$65)","v":{"v":6.870000000000002,"d":"6.87 m"}},{"v":4.71,"d":"4.71 m"},{"$f":"AU69-(AU69-AW69)*(AV$65-AU$65)/(AW$65-AU$65)","v":{"v":6.549999999999997,"d":"6.55 m"}},{"v":4.48,"d":"4.48 m"},{"$f":"AW69-(AW69-AY69)*(AX$65-AW$65)/(AY$65-AW$65)","v":{"v":6.370000000000008,"d":"6.37 m"}},{"v":4.27,"d":"4.27 m"},{"$f":"AY69-(AY69-BA69)*(AZ$65-AY$65)/(BA$65-AY$65)","v":{"v":6.169999999999993,"d":"6.17 m"}},{"v":4.08,"d":"4.08 m"},{"$nulls":7},"4c)   Dachneigung",{"v":1,"d":"1.000"},{"$nulls":4},"577297/8 + 30x30x2",{"v":6.52,"d":"6.52 m"},{"$f":"BP69-(BP69-BR69)*(BQ$64-BP$64)/(BR$64-BP$64)","v":{"v":8.62,"d":"8.62 m"}},{"v":6.1,"d":"6.10 m"},{"$f":"BR69-(BR69-BT69)*(BS$64-BR$64)/(BT$64-BR$64)","v":{"v":8.199999999999998,"d":"8.20 m"}},{"v":5.75,"d":"5.75 m"},{"$f":"BT69-(BT69-BV69)*(BU$64-BT$64)/(BV$64-BT$64)","v":{"v":7.849999999999996,"d":"7.85 m"}},{"v":5.45,"d":"5.45 m"},{"$f":"BV69-(BV69-BX69)*(BW$64-BV$64)/(BX$64-BV$64)","v":{"v":7.529999999999999,"d":"7.53 m"}},{"v":5.19,"d":"5.19 m"},{"$f":"BX69-(BX69-BZ69)*(BY$64-BX$64)/(BZ$64-BX$64)","v":{"v":7.260000000000005,"d":"7.26 m"}},{"v":4.96,"d":"4.96 m"},{"$f":"BZ69-(BZ69-CB69)*(CA$64-BZ$64)/(CB$64-BZ$64)","v":{"v":7.059999999999998,"d":"7.06 m"}},{"v":4.75,"d":"4.75 m"}]
[{"$nulls":6},"4a) zul. Durchbiegung",{"$f":"VLOOKUP($D$37,Daten!$A$44:$B$47,2)","v":{"v":1,"d":"1.000"}},null,{"$f":"IF(AND($D$9>J69,$D$9<J71),$D$9,\"nicht interpolieren\")","v":"nicht interpolieren"},{"$f":"K69-(K69-K71)*(J70-J69)/(J71-J69)","v":{"$error":"#VALUE!"}},null,"577297/8 + 30x30x2",{"v":3.75,"d":"3.75 m"},{"$f":"N70-(N70-P70)*(O$65-N$65)/(P$65-N$65)","v":{"v":4.650000000000001,"d":"4.65 m"}},{"v":3.57,"d":"3.57 m"},{"$f":"P70-(P70-R70)*(Q$65-P$65)/(R$65-P$65)","v":{"v":4.5299999999999985,"d":"4.53 m"}},{"v":3.41,"d":"3.41 m"},{"$f":"R70-(R70-T70)*(S$65-R$65)/(T$65-R$65)","v":{"v":4.390000000000001,"d":"4.39 m"}},{"v":3.27,"d":"3.27 m"},{"$f":"T70-(T70-V70)*(U$65-T$65)/(V$65-T$65)","v":{"v":4.31,"d":"4.31 m"}},{"v":3.14,"d":"3.14 m"},{"$f":"V70-(V70-X70)*(W$65-V$65)/(X$65-V$65)","v":{"v":4.2200000000000015,"d":"4.22 m"}},{"v":3.02,"d":"3.02 m"},{"$f":"X70-(X70-Z70)*(Y$65-X$65)/(Z$65-X$65)","v":{"v":4.22,"d":"4.22 m"}},{"v":2.9,"d":"2.90 m"},{"$nulls":7},"4b)  zul. Durchbiegung",{"$f":"VLOOKUP($D$37,Daten!$A$44:$B$47,2)","v":{"v":1,"d":"1.000"}},{"$nulls":4},"577297/8 + 30x30x2",{"v":5.9,"d":"5.90 m"},{"$f":"AO70-(AO70-AQ70)*(AP$65-AO$65)/(AQ$65-AO$65)","v":{"v":7.750000000000002,"d":"7.75 m"}},{"v":5.53,"d":"5.53 m"},{"$f":"AQ70-(AQ70-AS70)*(AR$65-AQ$65)/(AS$65-AQ$65)","v":{"v":7.450000000000003,"d":"7.45 m"}},{"v":5.21,"d":"5.21 m"},{"$f":"AS70-(AS70-AU70)*(AT$65-AS$65)/(AU$65-AS$65)","v":{"v":7.099999999999995,"d":"7.10 m"}},{"v":4.94,"d":"4.94 m"},{"$f":"AU70-(AU70-AW70)*(AV$65-AU$65)/(AW$65-AU$65)","v":{"v":6.860000000000003,"d":"6.86 m"}},{"v":4.7,"d":"4.70 m"},{"$f":"AW70-(AW70-AY70)*(AX$65-AW$65)/(AY$65-AW$65)","v":{"v":6.59,"d":"6.59 m"}},{"v":4.49,"d":"4.49 m"},{"$f":"AY70-(AY70-BA70)*(AZ$65-AY$65)/(BA$65-AY$65)","v":{"v":6.390000000000002,"d":"6.39 m"}},{"v":4.3,"d":"4.30 m"},{"$nulls":7},"4c)   zul. Durchbiegung",{"$f":"VLOOKUP($D$37,Daten!$A$44:$B$47,2)","v":{"v":1,"d":"1.000"}},{"$nulls":4},"577339/9",{"v":12.54,"d":"12.54 m"},{"$f":"BP70-(BP70-BR70)*(BQ$64-BP$64)/(BR$64-BP$64)","v":{"v":16.34,"d":"16.34 m"}},{"v":11.78,"d":"11.78 m"},{"$f":"BR70-(BR70-BT70)*(BS$64-BR$64)/(BT$64-BR$64)","v":{"v":15.619999999999994,"d":"15.62 m"}},{"v":11.14,"d":"11.14 m"},{"$f":"BT70-(BT70-BV70)*(BU$64-BT$64)/(BV$64-BT$64)","v":{"v":14.920000000000003,"d":"14.92 m"}},{"v":10.6,"d":"10.60 m"},{"$f":"BV70-(BV70-BX70)*(BW$64-BV$64)/(BX$64-BV$64)","v":{"v":14.440000000000005,"d":"14.44 m"}},{"v":10.12,"d":"10.12 m"},{"$f":"BX70-(BX70-BZ70)*(BY$64-BX$64)/(BZ$64-BX$64)","v":{"v":13.899999999999999,"d":"13.90 m"}},{"v":9.7,"d":"9.70 m"},{"$f":"BZ70-(BZ70-CB70)*(CA$64-BZ$64)/(CB$64-BZ$64)","v":{"v":13.399999999999988,"d":"13.40 m"}},{"v":9.33,"d":"9.33 m"}]
[{"$nulls":9},{"v":30,"d":"30.00 °"},0.96,null,"577339/9",{"v":6.5,"d":"6.50 m"},{"$f":"N71-(N71-P71)*(O$65-N$65)/(P$65-N$65)","v":{"v":7.849999999999998,"d":"7.85 m"}},{"v":6.23,"d":"6.23 m"},{"$f":"P71-(P71-R71)*(Q$65-P$65)/(R$65-P$65)","v":{"v":7.610000000000003,"d":"7.61 m"}},{"v":6,"d":"6.00 m"},{"$f":"R71-(R71-T71)*(S$65-R$65)/(T$65-R$65)","v":{"v":7.4,"d":"7.40 m"}},{"v":5.8,"d":"5.80 m"},{"$f":"T71-(T71-V71)*(U$65-T$65)/(V$65-T$65)","v":{"v":7.319999999999997,"d":"7.32 m"}},{"v":5.61,"d":"5.61 m"},{"$f":"V71-(V71-X71)*(W$65-V$65)/(X$65-V$65)","v":{"v":7.050000000000002,"d":"7.05 m"}},{"v":5.45,"d":"5.45 m"},{"$f":"X71-(X71-Z71)*(Y$65-X$65)/(Z$65-X$65)","v":{"v":6.950000000000003,"d":"6.95 m"}},{"v":5.3,"d":"5.30 m"},{"$nulls":13},"577339/9",{"v":11.34,"d":"11.34 m"},{"$f":"AO71-(AO71-AQ71)*(AP$65-AO$65)/(AQ$65-AO$65)","v":{"v":14.79,"d":"14.79 m"}},{"v":10.65,"d":"10.65 m"},{"$f":"AQ71-(AQ71-AS71)*(AR$65-AQ$65)/(AS$65-AQ$65)","v":{"v":14.070000000000002,"d":"14.07 m"}},{"v":10.08,"d":"10.08 m"},{"$f":"AS71-(AS71-AU71)*(AT$65-AS$65)/(AU$65-AS$65)","v":{"v":13.509999999999998,"d":"13.51 m"}},{"v":9.59,"d":"9.59 m"},{"$f":"AU71-(AU71-AW71)*(AV$65-AU$65)/(AW$65-AU$65)","v":{"v":13.029999999999998,"d":"13.03 m"}},{"v":9.16,"d":"9.16 m"},{"$f":"AW71-(AW71-AY71)*(AX$65-AW$65)/(AY$65-AW$65)","v":{"v":12.580000000000007,"d":"12.58 m"}},{"v":8.78,"d":"8.78 m"},{"$f":"AY71-(AY71-BA71)*(AZ$65-AY$65)/(BA$65-AY$65)","v":{"v":12.179999999999994,"d":"12.18 m"}},{"v":8.44,"d":"8.44 m"},{"$nulls":13},"577339/9 + 80x60x3",{"v":13.87,"d":"13.87 m"},{"v":17.469999999999995,"d":"17.47 m"},{"v":13.15,"d":"13.15 m"},{"v":16.930000000000007,"d":"16.93 m"},{"v":12.52,"d":"12.52 m"},{"v":16.29999999999999,"d":"16.30 m"},{"v":11.98,"d":"11.98 m"},{"v":15.820000000000004,"d":"15.82 m"},{"v":11.5,"d":"11.50 m"},{"v":15.369999999999997,"d":"15.37 m"},{"v":11.07,"d":"11.07 m"},{"v":14.870000000000005,"d":"14.87 m"},{"v":10.69,"d":"10.69 m"}]
[{"$nulls":12},"577339/9 + 80x60x3",{"v":7.19,"d":"7.19 m"},{"v":8.390000000000002,"d":"8.39 m"},{"v":6.95,"d":"6.95 m"},{"v":8.27,"d":"8.27 m"},{"v":6.73,"d":"6.73 m"},{"v":8.13,"d":"8.13 m"},{"v":6.53,"d":"6.53 m"},{"v":7.970000000000006,"d":"7.97 m"},{"v":6.35,"d":"6.35 m"},{"v":7.789999999999993,"d":"7.79 m"},{"v":6.19,"d":"6.19 m"},{"v":7.790000000000001,"d":"7.79 m"},{"v":6.03,"d":"6.03 m"},{"$nulls":13},"577339/9 + 80x60x3",{"v":12.44,"d":"12.44 m"},{"v":15.589999999999996,"d":"15.59 m"},{"v":11.81,"d":"11.81 m"},{"v":15.110000000000005,"d":"15.11 m"},{"v":11.26,"d":"11.26 m"},{"v":14.62,"d":"14.62 m"},{"v":10.78,"d":"10.78 m"},{"v":14.219999999999999,"d":"14.22 m"},{"v":10.35,"d":"10.35 m"},{"v":13.769999999999992,"d":"13.77 m"},{"v":9.97,"d":"9.97 m"},{"v":13.269999999999998,"d":"13.27 m"},{"v":9.64,"d":"9.64 m"},{"$nulls":13},"577339/9 + 80x60x5",{"v":14.67,"d":"14.67 m"},{"v":18.219999999999995,"d":"18.22 m"},{"v":13.96,"d":"13.96 m"},{"v":17.620000000000008,"d":"17.62 m"},{"v":13.35,"d":"13.35 m"},{"v":17.12999999999999,"d":"17.13 m"},{"v":12.81,"d":"12.81 m"},{"v":16.650000000000006,"d":"16.65 m"},{"v":12.33,"d":"12.33 m"},{"v":16.289999999999996,"d":"16.29 m"},{"v":11.89,"d":"11.89 m"},{"v":15.790000000000003,"d":"15.79 m"},{"v":11.5,"d":"11.50 m"}]
[{"$nulls":12},"577339/9 + 80x60x5",{"v":7.43,"d":"7.43 m"},{"v":8.579999999999998,"d":"8.58 m"},{"v":7.2,"d":"7.20 m"},{"v":8.46,"d":"8.46 m"},{"v":6.99,"d":"6.99 m"},{"v":8.320000000000002,"d":"8.32 m"},{"v":6.8,"d":"6.80 m"},{"v":8.16,"d":"8.16 m"},{"v":6.63,"d":"6.63 m"},{"v":8.070000000000002,"d":"8.07 m"},{"v":6.47,"d":"6.47 m"},{"v":7.9699999999999935,"d":"7.97 m"},{"v":6.32,"d":"6.32 m"},{"$nulls":13},"577339/9 + 80x60x5",{"v":13.11,"d":"13.11 m"},{"v":16.159999999999997,"d":"16.16 m"},{"v":12.5,"d":"12.50 m"},{"v":15.739999999999995,"d":"15.74 m"},{"v":11.96,"d":"11.96 m"},{"v":15.32,"d":"15.32 m"},{"v":11.48,"d":"11.48 m"},{"v":14.84,"d":"14.84 m"},{"v":11.06,"d":"11.06 m"},{"v":14.480000000000008,"d":"14.48 m"},{"v":10.68,"d":"10.68 m"},{"v":14.079999999999995,"d":"14.08 m"},{"v":10.34,"d":"10.34 m"},{"$nulls":13},"579504/5",{"v":10.42,"d":"10.42 m"},{"v":13.720000000000002,"d":"13.72 m"},{"v":9.76,"d":"9.76 m"},{"v":13.059999999999993,"d":"13.06 m"},{"v":9.21,"d":"9.21 m"},{"v":12.500000000000002,"d":"12.50 m"},{"v":8.74,"d":"8.74 m"},{"v":12.020000000000003,"d":"12.02 m"},{"v":8.33,"d":"8.33 m"},{"v":11.570000000000004,"d":"11.57 m"},{"v":7.97,"d":"7.97 m"},{"v":11.069999999999993,"d":"11.07 m"},{"v":7.66,"d":"7.66 m"}]
[{"$nulls":12},"579504/5",{"v":6.25,"d":"6.25 m"},{"v":7.599999999999998,"d":"7.60 m"},{"v":5.98,"d":"5.98 m"},{"v":7.48,"d":"7.48 m"},{"v":5.73,"d":"5.73 m"},{"v":7.200000000000005,"d":"7.20 m"},{"v":5.52,"d":"5.52 m"},{"v":7.119999999999994,"d":"7.12 m"},{"v":5.32,"d":"5.32 m"},{"v":6.85,"d":"6.85 m"},{"v":5.15,"d":"5.15 m"},{"v":6.75,"d":"6.75 m"},{"v":4.99,"d":"4.99 m"},{"$nulls":13},"579504/5",{"v":9.44,"d":"9.44 m"},{"v":12.439999999999998,"d":"12.44 m"},{"v":8.84,"d":"8.84 m"},{"v":11.84,"d":"11.84 m"},{"v":8.34,"d":"8.34 m"},{"v":11.279999999999998,"d":"11.28 m"},{"v":7.92,"d":"7.92 m"},{"v":10.880000000000003,"d":"10.88 m"},{"v":7.55,"d":"7.55 m"},{"v":10.429999999999996,"d":"10.43 m"},{"v":7.23,"d":"7.23 m"},{"v":10.129999999999999,"d":"10.13 m"},{"v":6.94,"d":"6.94 m"},{"$nulls":13},"579504/5 + 100x20",{"v":13.76,"d":"13.76 m"},{"$f":"BP74-(BP74-BR74)*(BQ$64-BP$64)/(BR$64-BP$64)","v":{"v":16.81,"d":"16.81 m"}},{"v":13.15,"d":"13.15 m"},{"v":16.390000000000008,"d":"16.39 m"},{"v":12.61,"d":"12.61 m"},{"v":15.899999999999988,"d":"15.90 m"},{"v":12.14,"d":"12.14 m"},{"v":15.579999999999998,"d":"15.58 m"},{"v":11.71,"d":"11.71 m"},{"v":15.220000000000006,"d":"15.22 m"},{"v":11.32,"d":"11.32 m"},{"v":14.819999999999993,"d":"14.82 m"},{"v":10.97,"d":"10.97 m"}]
[{"$nulls":12},"579504/5 + 100x20",{"v":7.65,"d":"7.65 m"},{"$f":"N75-(N75-P75)*(O$65-N$65)/(P$65-N$65)","v":{"v":8.750000000000004,"d":"8.75 m"}},{"v":7.43,"d":"7.43 m"},{"$f":"P75-(P75-R75)*(Q$65-P$65)/(R$65-P$65)","v":{"v":8.629999999999995,"d":"8.63 m"}},{"v":7.23,"d":"7.23 m"},{"$f":"R75-(R75-T75)*(S$65-R$65)/(T$65-R$65)","v":{"v":8.490000000000004,"d":"8.49 m"}},{"v":7.05,"d":"7.05 m"},{"$f":"T75-(T75-V75)*(U$65-T$65)/(V$65-T$65)","v":{"v":8.330000000000002,"d":"8.33 m"}},{"v":6.89,"d":"6.89 m"},{"$f":"V75-(V75-X75)*(W$65-V$65)/(X$65-V$65)","v":{"v":8.329999999999993,"d":"8.33 m"}},{"v":6.73,"d":"6.73 m"},{"$f":"X75-(X75-Z75)*(Y$65-X$65)/(Z$65-X$65)","v":{"v":8.130000000000004,"d":"8.13 m"}},{"v":6.59,"d":"6.59 m"},{"$nulls":13},"579504/5 + 100x20",{"v":12.23,"d":"12.23 m"},{"$f":"AO75-(AO75-AQ75)*(AP$65-AO$65)/(AQ$65-AO$65)","v":{"v":14.73,"d":"14.73 m"}},{"v":11.73,"d":"11.73 m"},{"$f":"AQ75-(AQ75-AS75)*(AR$65-AQ$65)/(AS$65-AQ$65)","v":{"v":14.490000000000006,"d":"14.49 m"}},{"v":11.27,"d":"11.27 m"},{"$f":"AS75-(AS75-AU75)*(AT$65-AS$65)/(AU$65-AS$65)","v":{"v":14.209999999999997,"d":"14.21 m"}},{"v":10.85,"d":"10.85 m"},{"$f":"AU75-(AU75-AW75)*(AV$65-AU$65)/(AW$65-AU$65)","v":{"v":13.809999999999993,"d":"13.81 m"}},{"v":10.48,"d":"10.48 m"},{"$f":"AW75-(AW75-AY75)*(AX$65-AW$65)/(AY$65-AW$65)","v":{"v":13.54,"d":"13.54 m"}},{"v":10.14,"d":"10.14 m"},{"$f":"AY75-(AY75-BA75)*(AZ$65-AY$65)/(BA$65-AY$65)","v":{"v":13.240000000000002,"d":"13.24 m"}},{"v":9.83,"d":"9.83 m"},{"$nulls":13},"579504/5 + 100x20x3",{"v":12.14,"d":"12.14 m"},{"$f":"BP75-(BP75-BR75)*(BQ$64-BP$64)/(BR$64-BP$64)","v":{"v":15.440000000000001,"d":"15.44 m"}},{"v":11.48,"d":"11.48 m"},{"$f":"BR75-(BR75-BT75)*(BS$64-BR$64)/(BT$64-BR$64)","v":{"v":14.900000000000002,"d":"14.90 m"}},{"v":10.91,"d":"10.91 m"},{"$f":"BT75-(BT75-BV75)*(BU$64-BT$64)/(BV$64-BT$64)","v":{"v":14.339999999999998,"d":"14.34 m"}},{"v":10.42,"d":"10.42 m"},{"$f":"BV75-(BV75-BX75)*(BW$64-BV$64)/(BX$64-BV$64)","v":{"v":13.86,"d":"13.86 m"}},{"v":9.99,"d":"9.99 m"},{"$f":"BX75-(BX75-BZ75)*(BY$64-BX$64)/(BZ$64-BX$64)","v":{"v":13.500000000000007,"d":"13.50 m"}},{"v":9.6,"d":"9.60 m"},{"$f":"BZ75-(BZ75-CB75)*(CA$64-BZ$64)/(CB$64-BZ$64)","v":{"v":12.999999999999995,"d":"13.00 m"}},{"v":9.26,"d":"9.26 m"}]
[{"$nulls":12},"579504/5 + 100x20x3",{"v":7.11,"d":"7.11 m"},{"v":8.410000000000004,"d":"8.41 m"},{"v":6.85,"d":"6.85 m"},{"v":8.229999999999997,"d":"8.23 m"},{"v":6.62,"d":"6.62 m"},{"v":8.02,"d":"8.02 m"},{"v":6.42,"d":"6.42 m"},{"v":7.859999999999998,"d":"7.86 m"},{"v":6.24,"d":"6.24 m"},{"v":7.77,"d":"7.77 m"},{"v":6.07,"d":"6.07 m"},{"v":7.67,"d":"7.67 m"},{"v":5.91,"d":"5.91 m"},{"$nulls":13},"579504/5 + 100x20x3",{"v":10.92,"d":"10.92 m"},{"v":13.87,"d":"13.87 m"},{"v":10.33,"d":"10.33 m"},{"v":13.33,"d":"13.33 m"},{"v":9.83,"d":"9.83 m"},{"v":12.909999999999993,"d":"12.91 m"},{"v":9.39,"d":"9.39 m"},{"v":12.510000000000007,"d":"12.51 m"},{"v":9,"d":"9.00 m"},{"v":12.059999999999999,"d":"12.06 m"},{"v":8.66,"d":"8.66 m"},{"v":11.760000000000002,"d":"11.76 m"},{"v":8.35,"d":"8.35 m"}]
[{"$nulls":66},"l zul"]
[{"$nulls":12},"l zul",{"$nulls":26},"l zul",{"$nulls":26},"Gratsparren","c","l zul"]
[{"$nulls":6},"4a) Tabellenwert l",{"$f":"O80","v":{"v":7.05,"d":"7.05 m"}},{"$nulls":4},"Gratsparren","c","l zul",{"$nulls":18},"4b)  Tabellenwert l",{"$f":"AP80","v":{"v":10.85,"d":"10.85 m"}},{"$nulls":4},"Gratsparren","c","l zul",{"$nulls":18},"4c)   Tabellenwert l",{"$f":"BQ79","v":{"v":12.14,"d":"12.14 m"}},{"$nulls":4},{"$f":"IF($D$38=\"\",\"\",MATCH($D$38,BO65:BO75))","v":10},{"$f":"IF($D$36>1.1,\"\",MATCH($D$36,BP64:CB64,0))","v":7},{"$f":"IF(OR($D$10=\"\",$D$36=\"\"),0,INDEX(BP65:CB75,BO79,BP79))","v":{"v":12.14,"d":"12.14 m"}}]
[{"$nulls":6},"4a) Korrigierter lzul1",{"$f":"H79*H66*H67*H68*H69*H70","v":{"v":6.9231,"d":"6.92 m"}},{"$nulls":4},{"$f":"IF($D$38=\"\",\"\",MATCH($D$38,M66:M76))","v":10},{"$f":"IF($D$36>1.1,\"\",MATCH($D$36,N65:Z65,0))","v":7},{"$f":"IF(OR($D$10=\"\",$D$36=\"\"),0,INDEX(N66:Z76,M80,N80))","v":{"v":7.05,"d":"7.05 m"}},{"$nulls":18},"4b)  Korrigierter lzul1",{"$f":"AI79*AI66*AI67*AI68*AI69*AI70","v":{"v":10.546199999999999,"d":"10.55 m"}},{"$nulls":4},{"$f":"IF($D$38=\"\",\"\",MATCH($D$38,AN66:AN76))","v":10},{"$f":"IF($D$36>1.1,\"\",MATCH($D$36,AO65:BA65,0))","v":7},{"$f":"IF(OR($D$10=\"\",$D$36=\"\"),0,INDEX(AO66:BA76,AN80,AO80))","v":{"v":10.85,"d":"10.85 m"}},{"$nulls":18},"4c)   Korrigierter lzul1",{"$f":"BJ79*BJ66*BJ67*BJ68*BJ69*BJ70","v":{"v":121400,"d":"121,400.00 m"}}]
[]
[{"$nulls":39},"Gratsparren",{"v":1,"d":"1.00 m"},{"$f":"IF(AND($D$43>1,$D$43<1.5),$D$43,0)","v":{"v":0,"d":"0.00 m"}},{"v":1.5,"d":"1.50 m"},{"$f":"IF(AND($D$43>1.5,$D$43<2),$D$43,0)","v":{"v":0,"d":"0.00 m"}},{"v":2,"d":"2.00 m"},{"$f":"IF(AND($D$43>2,$D$43<2.5),$D$43,0)","v":{"v":0,"d":"0.00 m"}},{"v":2.5,"d":"2.50 m"},{"$f":"IF(AND($D$43>2.5,$D$43<3),$D$43,0)","v":{"v":0,"d":"0.00 m"}},{"v":3,"d":"3.00 m"},{"$f":"IF(AND($D$43>3,$D$43<3.5),$D$43,0)","v":{"v":3.1,"d":"3.10 m"}},{"v":3.5,"d":"3.50 m"},"la=l",{"$nulls":8},"5c) Korrekturfaktoren",{"$nulls":5},"Gratsparren",{"v":1,"d":"1.00 m"},{"$f":"IF(AND($D$43>1,$D$43<1.5),$D$43,0)","v":{"v":0,"d":"0.00 m"}},{"v":1.5,"d":"1.50 m"},{"$f":"IF(AND($D$43>1.5,$D$43<2),$D$43,0)","v":{"v":0,"d":"0.00 m"}},{"v":2,"d":"2.00 m"},{"$f":"IF(AND($D$43>2,$D$43<2.5),$D$43,0)","v":{"v":0,"d":"0.00 m"}},{"v":2.5,"d":"2.50 m"},{"$f":"IF(AND($D$43>2.5,$D$43<3),$D$43,0)","v":{"v":0,"d":"0.00 m"}},{"v":3,"d":"3.00 m"},{"$f":"IF(AND($D$43>3,$D$43<3.5),$D$43,0)","v":{"v":3.1,"d":"3.10 m"}},{"v":3.5,"d":"3.50 m"},"la=l"]
[{"$nulls":39},"577291/2",{"v":6.46,"d":"6.46 m"},{"$f":"AO83-(AO83-AQ83)*(AP$82-AO$82)/(AQ$82-AO$82)","v":{"v":8.86,"d":"8.86 m"}},{"v":5.26,"d":"5.26 m"},{"$f":"AQ83-(AQ83-AS83)*(AR$82-AQ$82)/(AS$82-AQ$82)","v":{"v":7.689999999999999,"d":"7.69 m"}},{"v":4.45,"d":"4.45 m"},{"$f":"AS83-(AS83-AU83)*(AT$82-AS$82)/(AU$82-AS$82)","v":{"v":6.9700000000000015,"d":"6.97 m"}},{"v":3.82,"d":"3.82 m"},{"$f":"AU83-(AU83-AW83)*(AV$82-AU$82)/(AW$82-AU$82)","v":{"v":6.5699999999999985,"d":"6.57 m"}},{"v":3.27,"d":"3.27 m"},null,null,{"v":3.13,"d":"3.13 m"},{"$nulls":8},"5c) Verglasung",{"$f":"BJ2","v":{"v":1,"d":"1.000"}},{"$nulls":4},"577291/2",{"v":6.93,"d":"6.93 m"},{"$f":"BP83-(BP83-BR83)*(BQ$82-BP$82)/(BR$82-BP$82)","v":{"v":9.489999999999998,"d":"9.49 m"}},{"v":5.65,"d":"5.65 m"},{"$f":"BR83-(BR83-BT83)*(BS$82-BR$82)/(BT$82-BR$82)","v":{"v":8.23,"d":"8.23 m"}},{"v":4.79,"d":"4.79 m"},{"$f":"BT83-(BT83-BV83)*(BU$82-BT$82)/(BV$82-BT$82)","v":{"v":7.430000000000001,"d":"7.43 m"}},{"v":4.13,"d":"4.13 m"},{"$nulls":4},{"v":3.28,"d":"3.28 m"}]
[{"$nulls":6},"5a) Korrekturfaktoren",{"$nulls":5},"Gratsparren",{"v":1,"d":"1.00 m"},{"$f":"IF(AND($D$43>1,$D$43<1.5),$D$43,0)","v":{"v":0,"d":"0.00 m"}},{"v":1.5,"d":"1.50 m"},{"$f":"IF(AND($D$43>1.5,$D$43<2),$D$43,0)","v":{"v":0,"d":"0.00 m"}},{"v":2,"d":"2.00 m"},{"$f":"IF(AND($D$43>2,$D$43<2.5),$D$43,0)","v":{"v":0,"d":"0.00 m"}},{"v":2.5,"d":"2.50 m"},{"$f":"IF(AND($D$43>2.5,$D$43<3),$D$43,0)","v":{"v":0,"d":"0.00 m"}},{"v":3,"d":"3.00 m"},{"$f":"IF(AND($D$43>3,$D$43<3.5),$D$43,0)","v":{"v":3.1,"d":"3.10 m"}},{"v":3.5,"d":"3.50 m"},"la=l",{"$nulls":8},"5b) Korrekturfaktoren",{"$nulls":5},"577293/4",{"v":6.47,"d":"6.47 m"},{"$f":"AO84-(AO84-AQ84)*(AP$82-AO$82)/(AQ$82-AO$82)","v":{"v":8.870000000000001,"d":"8.87 m"}},{"v":5.27,"d":"5.27 m"},{"$f":"AQ84-(AQ84-AS84)*(AR$82-AQ$82)/(AS$82-AQ$82)","v":{"v":7.699999999999998,"d":"7.70 m"}},{"v":4.46,"d":"4.46 m"},{"$f":"AS84-(AS84-AU84)*(AT$82-AS$82)/(AU$82-AS$82)","v":{"v":7.0200000000000005,"d":"7.02 m"}},{"v":3.82,"d":"3.82 m"},{"$f":"AU84-(AU84-AW84)*(AV$82-AU$82)/(AW$82-AU$82)","v":{"v":6.52,"d":"6.52 m"}},{"v":3.28,"d":"3.28 m"},null,null,{"v":3.14,"d":"3.14 m"},{"$nulls":8},"5c) Schnee",{"$f":"BJ3","v":{"v":10000,"d":"10000.000"}},{"$nulls":4},"577293/4",{"v":6.95,"d":"6.95 m"},{"$f":"BP84-(BP84-BR84)*(BQ$82-BP$82)/(BR$82-BP$82)","v":{"v":9.530000000000001,"d":"9.53 m"}},{"v":5.66,"d":"5.66 m"},{"$f":"BR84-(BR84-BT84)*(BS$82-BR$82)/(BT$82-BR$82)","v":{"v":8.240000000000002,"d":"8.24 m"}},{"v":4.8,"d":"4.80 m"},{"$f":"BT84-(BT84-BV84)*(BU$82-BT$82)/(BV$82-BT$82)","v":{"v":7.399999999999998,"d":"7.40 m"}},{"v":4.15,"d":"4.15 m"},{"$f":"BV84-(BV84-BX84)*(BW$82-BV$82)/(BX$82-BV$82)","v":{"v":7.000000000000002,"d":"7.00 m"}},{"v":3.58,"d":"3.58 m"},null,null,{"v":3.28,"d":"3.28 m"}]
[{"$nulls":6},"5a) Verglasung",{"$f":"H2","v":{"v":1,"d":"1.000"}},{"$nulls":4},"577291/2",{"v":4.34,"d":"4.34 m"},{"$f":"N85-(N85-P85)*(O$84-N$84)/(P$84-N$84)","v":{"v":5.659999999999999,"d":"5.66 m"}},{"v":3.68,"d":"3.68 m"},{"$f":"P85-(P85-R85)*(Q$84-P$84)/(R$84-P$84)","v":{"v":5.300000000000001,"d":"5.30 m"}},{"v":3.14,"d":"3.14 m"},{"$f":"R85-(R85-T85)*(S$84-R$84)/(T$84-R$84)","v":{"v":5.1800000000000015,"d":"5.18 m"}},{"v":2.63,"d":"2.63 m"},{"$nulls":4},{"v":2.56,"d":"2.56 m"},{"$nulls":8},"5b) Verglasung",{"$f":"AI2","v":{"v":1,"d":"1.000"}},{"$nulls":4},"577293/4 + 70x30x3",{"v":7.87,"d":"7.87 m"},{"$f":"AO85-(AO85-AQ85)*(AP$82-AO$82)/(AQ$82-AO$82)","v":{"v":10.55,"d":"10.55 m"}},{"v":6.53,"d":"6.53 m"},{"$f":"AQ85-(AQ85-AS85)*(AR$82-AQ$82)/(AS$82-AQ$82)","v":{"v":9.23,"d":"9.23 m"}},{"v":5.63,"d":"5.63 m"},{"$f":"AS85-(AS85-AU85)*(AT$82-AS$82)/(AU$82-AS$82)","v":{"v":8.43,"d":"8.43 m"}},{"v":4.93,"d":"4.93 m"},{"$f":"AU85-(AU85-AW85)*(AV$82-AU$82)/(AW$82-AU$82)","v":{"v":7.879999999999999,"d":"7.88 m"}},{"v":4.34,"d":"4.34 m"},{"$f":"AW85-(AW85-AY85)*(AX$82-AW$82)/(AY$82-AW$82)","v":{"v":4.234,"d":"4.23 m"}},{"v":3.81,"d":"3.81 m"},{"v":3.68,"d":"3.68 m"},{"$nulls":8},"5c) Wind",{"$f":"BJ4","v":{"v":1,"d":"1.000"}},{"$nulls":4},"577293/4 + 70x30x3",{"v":8.51,"d":"8.51 m"},{"$f":"BP85-(BP85-BR85)*(BQ$82-BP$82)/(BR$82-BP$82)","v":{"v":11.45,"d":"11.45 m"}},{"v":7.04,"d":"7.04 m"},{"$f":"BR85-(BR85-BT85)*(BS$82-BR$82)/(BT$82-BR$82)","v":{"v":9.95,"d":"9.95 m"}},{"v":6.07,"d":"6.07 m"},{"$f":"BT85-(BT85-BV85)*(BU$82-BT$82)/(BV$82-BT$82)","v":{"v":8.990000000000002,"d":"8.99 m"}},{"v":5.34,"d":"5.34 m"},{"$f":"BV85-(BV85-BX85)*(BW$82-BV$82)/(BX$82-BV$82)","v":{"v":8.440000000000001,"d":"8.44 m"}},{"v":4.72,"d":"4.72 m"},{"$f":"BX85-(BX85-BZ85)*(BY$82-BX$82)/(BZ$82-BX$82)","v":{"v":4.609999999999999,"d":"4.61 m"}},{"v":4.17,"d":"4.17 m"},{"v":3.83,"d":"3.83 m"}]
[{"$nulls":6},"5a) Schnee",{"$f":"H3","v":0.982},{"$nulls":4},"577293/4",{"v":4.52,"d":"4.52 m"},{"$f":"N86-(N86-P86)*(O$84-N$84)/(P$84-N$84)","v":{"v":5.879999999999999,"d":"5.88 m"}},{"v":3.84,"d":"3.84 m"},{"$f":"P86-(P86-R86)*(Q$84-P$84)/(R$84-P$84)","v":{"v":5.489999999999999,"d":"5.49 m"}},{"v":3.29,"d":"3.29 m"},{"$f":"R86-(R86-T86)*(S$84-R$84)/(T$84-R$84)","v":{"v":5.330000000000001,"d":"5.33 m"}},{"v":2.78,"d":"2.78 m"},{"$nulls":4},{"v":2.64,"d":"2.64 m"},{"$nulls":8},"5b) Schnee",{"$f":"AI3","v":0.972},{"$nulls":4},"577297/8",{"v":4.73,"d":"4.73 m"},{"$f":"AO86-(AO86-AQ86)*(AP$82-AO$82)/(AQ$82-AO$82)","v":{"v":6.610000000000001,"d":"6.61 m"}},{"v":3.79,"d":"3.79 m"},{"$f":"AQ86-(AQ86-AS86)*(AR$82-AQ$82)/(AS$82-AQ$82)","v":{"v":5.7700000000000005,"d":"5.77 m"}},{"v":3.13,"d":"3.13 m"},{"$f":"AS86-(AS86-AU86)*(AT$82-AS$82)/(AU$82-AS$82)","v":{"v":5.329999999999999,"d":"5.33 m"}},{"v":2.58,"d":"2.58 m"},{"$nulls":4},{"v":2.54,"d":"2.54 m"},{"$nulls":8},"5c) Dachneigung",{"$f":"BJ5","v":{"v":1,"d":"1.000"}},{"$nulls":4},"577297/8",{"v":5.09,"d":"5.09 m"},{"$f":"BP86-(BP86-BR86)*(BQ$82-BP$82)/(BR$82-BP$82)","v":{"v":7.09,"d":"7.09 m"}},{"v":4.09,"d":"4.09 m"},{"$f":"BR86-(BR86-BT86)*(BS$82-BR$82)/(BT$82-BR$82)","v":{"v":6.1899999999999995,"d":"6.19 m"}},{"v":3.39,"d":"3.39 m"},{"$f":"BT86-(BT86-BV86)*(BU$82-BT$82)/(BV$82-BT$82)","v":{"v":5.630000000000001,"d":"5.63 m"}},{"v":2.83,"d":"2.83 m"},{"$nulls":4},{"v":2.66,"d":"2.66 m"}]
[{"$nulls":6},"5a) Wind",{"$f":"H4","v":{"v":1,"d":"1.000"}},{"$nulls":4},"577293/4 + 70x30x3",{"v":5.18,"d":"5.18 m"},{"$f":"N87-(N87-P87)*(O$84-N$84)/(P$84-N$84)","v":{"v":6.559999999999999,"d":"6.56 m"}},{"v":4.49,"d":"4.49 m"},{"$f":"P87-(P87-R87)*(Q$84-P$84)/(R$84-P$84)","v":{"v":6.140000000000001,"d":"6.14 m"}},{"v":3.94,"d":"3.94 m"},{"$f":"R87-(R87-T87)*(S$84-R$84)/(T$84-R$84)","v":{"v":5.979999999999999,"d":"5.98 m"}},{"v":3.43,"d":"3.43 m"},{"$nulls":4},{"v":2.96,"d":"2.96 m"},{"$nulls":8},"5b) Wind",{"$f":"AI4","v":{"v":1,"d":"1.000"}},{"$nulls":4},"577297/8 + 30x30x2",{"v":5.05,"d":"5.05 m"},{"$f":"AO87-(AO87-AQ87)*(AP$82-AO$82)/(AQ$82-AO$82)","v":{"v":6.989999999999999,"d":"6.99 m"}},{"v":4.08,"d":"4.08 m"},{"$f":"AQ87-(AQ87-AS87)*(AR$82-AQ$82)/(AS$82-AQ$82)","v":{"v":6.120000000000001,"d":"6.12 m"}},{"v":3.4,"d":"3.40 m"},{"$f":"AS87-(AS87-AU87)*(AT$82-AS$82)/(AU$82-AS$82)","v":{"v":5.6,"d":"5.60 m"}},{"v":2.85,"d":"2.85 m"},{"$nulls":4},{"v":2.67,"d":"2.67 m"},{"$nulls":14},"577297/8 + 30x30x2",{"v":5.44,"d":"5.44 m"},{"$f":"BP87-(BP87-BR87)*(BQ$82-BP$82)/(BR$82-BP$82)","v":{"v":7.5200000000000005,"d":"7.52 m"}},{"v":4.4,"d":"4.40 m"},{"$f":"BR87-(BR87-BT87)*(BS$82-BR$82)/(BT$82-BR$82)","v":{"v":6.530000000000001,"d":"6.53 m"}},{"v":3.69,"d":"3.69 m"},{"$f":"BT87-(BT87-BV87)*(BU$82-BT$82)/(BV$82-BT$82)","v":{"v":6.01,"d":"6.01 m"}},{"v":3.11,"d":"3.11 m"},{"$nulls":4},{"v":2.8,"d":"2.80 m"}]
[{"$nulls":6},"5a) Dachneigung",{"$f":"H5","v":{"v":1,"d":"1.000"}},{"$nulls":4},"577297/8",{"v":3.09,"d":"3.09 m"},{"$f":"N88-(N88-P88)*(O$84-N$84)/(P$84-N$84)","v":{"v":4.25,"d":"4.25 m"}},{"v":2.51,"d":"2.51 m"},{"$nulls":8},{"v":2,"d":"2.00 m"},{"$nulls":8},"5b) Dachneigung",{"$f":"AI5","v":{"v":1,"d":"1.000"}},{"$nulls":4},"577339/9",{"v":9.38,"d":"9.38 m"},{"$f":"AO88-(AO88-AQ88)*(AP$82-AO$82)/(AQ$82-AO$82)","v":{"v":12.640000000000002,"d":"12.64 m"}},{"v":7.75,"d":"7.75 m"},{"$f":"AQ88-(AQ88-AS88)*(AR$82-AQ$82)/(AS$82-AQ$82)","v":{"v":10.93,"d":"10.93 m"}},{"v":6.69,"d":"6.69 m"},{"$f":"AS88-(AS88-AU88)*(AT$82-AS$82)/(AU$82-AS$82)","v":{"v":9.850000000000001,"d":"9.85 m"}},{"v":5.9,"d":"5.90 m"},{"$f":"AU88-(AU88-AW88)*(AV$82-AU$82)/(AW$82-AU$82)","v":{"v":9.200000000000001,"d":"9.20 m"}},{"v":5.24,"d":"5.24 m"},{"$f":"AW88-(AW88-AY88)*(AX$82-AW$82)/(AY$82-AW$82)","v":{"v":5.124,"d":"5.12 m"}},{"v":4.66,"d":"4.66 m"},{"v":4.06,"d":"4.06 m"},{"$nulls":8},"Korrekturwert für Fall  la= l",{"$f":"IF($D$43=$D$44,(BJ83^0.5)*(BJ84^0.5)*(BJ85^0.5)*(BJ86^0.5),0)","v":{"v":100,"d":"100.000"}},{"$nulls":4},"577339/9",{"v":10.1,"d":"10.10 m"},{"$f":"BP88-(BP88-BR88)*(BQ$82-BP$82)/(BR$82-BP$82)","v":{"v":13.639999999999999,"d":"13.64 m"}},{"v":8.33,"d":"8.33 m"},{"$f":"BR88-(BR88-BT88)*(BS$82-BR$82)/(BT$82-BR$82)","v":{"v":11.75,"d":"11.75 m"}},{"v":7.19,"d":"7.19 m"},{"$f":"BT88-(BT88-BV88)*(BU$82-BT$82)/(BV$82-BT$82)","v":{"v":10.550000000000004,"d":"10.55 m"}},{"v":6.35,"d":"6.35 m"},{"$f":"BV88-(BV88-BX88)*(BW$82-BV$82)/(BX$82-BV$82)","v":{"v":9.799999999999997,"d":"9.80 m"}},{"v":5.66,"d":"5.66 m"},{"$f":"BX88-(BX88-BZ88)*(BY$82-BX$82)/(BZ$82-BX$82)","v":{"v":5.542,"d":"5.54 m"}},{"v":5.07,"d":"5.07 m"},{"v":4.26,"d":"4.26 m"}]
[{"$nulls":12},"577297/8 + 30x30x2",{"v":3.24,"d":"3.24 m"},{"$f":"N89-(N89-P89)*(O$84-N$84)/(P$84-N$84)","v":{"v":4.380000000000001,"d":"4.38 m"}},{"v":2.67,"d":"2.67 m"},{"$f":"P89-(P89-R89)*(Q$84-P$84)/(R$84-P$84)","v":{"v":4.199999999999999,"d":"4.20 m"}},{"v":2.16,"d":"2.16 m"},{"$nulls":6},{"v":2.08,"d":"2.08 m"},{"$nulls":14},"577339/9 + 80x60x3",{"v":10.6,"d":"10.60 m"},{"v":13.92,"d":"13.92 m"},{"v":8.94,"d":"8.94 m"},{"v":12.299999999999997,"d":"12.30 m"},{"v":7.82,"d":"7.82 m"},{"v":11.220000000000002,"d":"11.22 m"},{"v":6.97,"d":"6.97 m"},{"v":10.47,"d":"10.47 m"},{"v":6.27,"d":"6.27 m"},{"v":6.148,"d":"6.15 m"},{"v":5.66,"d":"5.66 m"},{"v":4.54,"d":"4.54 m"},{"$nulls":14},"577339/9 + 80x60x3",{"v":11.51,"d":"11.51 m"},{"v":15.209999999999999,"d":"15.21 m"},{"v":9.66,"d":"9.66 m"},{"v":13.320000000000002,"d":"13.32 m"},{"v":8.44,"d":"8.44 m"},{"v":12.079999999999997,"d":"12.08 m"},{"v":7.53,"d":"7.53 m"},{"v":11.23,"d":"11.23 m"},{"v":6.79,"d":"6.79 m"},{"v":6.662,"d":"6.66 m"},{"v":6.15,"d":"6.15 m"},{"v":4.77,"d":"4.77 m"}]
[{"$nulls":6},"Korrekturwert für Fall  la= l",{"$f":"IF($D$43=$D$44,($H$85^0.5)*($H$86^0.5)*($H$87^0.5)*($H$88^0.5),0)","v":{"v":0.9909591313469996,"d":"0.991"}},{"$nulls":4},"577339/9",{"v":5.62,"d":"5.62 m"},{"$f":"N90-(N90-P90)*(O$84-N$84)/(P$84-N$84)","v":{"v":7.180000000000001,"d":"7.18 m"}},{"v":4.84,"d":"4.84 m"},{"$f":"P90-(P90-R90)*(Q$84-P$84)/(R$84-P$84)","v":{"v":6.639999999999999,"d":"6.64 m"}},{"v":4.24,"d":"4.24 m"},{"$f":"R90-(R90-T90)*(S$84-R$84)/(T$84-R$84)","v":{"v":6.360000000000001,"d":"6.36 m"}},{"v":3.71,"d":"3.71 m"},{"$f":"T90-(T90-V90)*(U$84-T$84)/(V$84-T$84)","v":{"v":6.21,"d":"6.21 m"}},{"v":3.21,"d":"3.21 m"},null,null,{"v":3.1,"d":"3.10 m"},{"$nulls":8},"Korrekturwert für Fall  la= l",{"$f":"IF($D$43=$D$44,(AI85^0.5)*(AI86^0.5)*(AI87^0.5)*(AI88^0.5),0)","v":{"v":0.985900603509299,"d":"0.986"}},{"$nulls":4},"577339/9 + 80x60x5",{"v":11.33,"d":"11.33 m"},{"v":14.67,"d":"14.67 m"},{"v":9.66,"d":"9.66 m"},{"v":13.110000000000001,"d":"13.11 m"},{"v":8.51,"d":"8.51 m"},{"v":12.03,"d":"12.03 m"},{"v":7.63,"d":"7.63 m"},{"v":11.229999999999999,"d":"11.23 m"},{"v":6.91,"d":"6.91 m"},{"v":6.784,"d":"6.78 m"},{"v":6.28,"d":"6.28 m"},{"v":4.83,"d":"4.83 m"},{"$nulls":14},"577339/9 + 80x60x5",{"v":12.36,"d":"12.36 m"},{"v":16.119999999999997,"d":"16.12 m"},{"v":10.48,"d":"10.48 m"},{"v":14.26,"d":"14.26 m"},{"v":9.22,"d":"9.22 m"},{"v":13.060000000000004,"d":"13.06 m"},{"v":8.26,"d":"8.26 m"},{"v":12.109999999999998,"d":"12.11 m"},{"v":7.49,"d":"7.49 m"},{"v":7.358,"d":"7.36 m"},{"v":6.83,"d":"6.83 m"},{"v":5.08,"d":"5.08 m"}]
[{"$nulls":12},"577339/9 + 80x60x3",{"v":6.46,"d":"6.46 m"},{"v":7.96,"d":"7.96 m"},{"v":5.71,"d":"5.71 m"},{"v":7.509999999999999,"d":"7.51 m"},{"v":5.11,"d":"5.11 m"},{"v":7.230000000000001,"d":"7.23 m"},{"v":4.58,"d":"4.58 m"},{"v":7.08,"d":"7.08 m"},{"v":4.08,"d":"4.08 m"},{"$f":"V91-(V91-X91)*(W$84-V$84)/(X$84-V$84)","v":{"v":3.98,"d":"3.98 m"}},{"v":3.58,"d":"3.58 m"},{"v":3.54,"d":"3.54 m"},{"$nulls":14},"579504/5",{"v":7.98,"d":"7.98 m"},{"v":10.88,"d":"10.88 m"},{"v":6.53,"d":"6.53 m"},{"v":9.350000000000001,"d":"9.35 m"},{"v":5.59,"d":"5.59 m"},{"v":8.469999999999999,"d":"8.47 m"},{"v":4.87,"d":"4.87 m"},{"v":7.870000000000003,"d":"7.87 m"},{"v":4.27,"d":"4.27 m"},{"v":4.164,"d":"4.16 m"},{"v":3.74,"d":"3.74 m"},{"v":3.62,"d":"3.62 m"},{"$nulls":14},"579504/5",{"v":8.56,"d":"8.56 m"},{"v":11.680000000000001,"d":"11.68 m"},{"v":7,"d":"7.00 m"},{"v":10,"d":"10.00 m"},{"v":6,"d":"6.00 m"},{"v":9,"d":"9.00 m"},{"v":5.25,"d":"5.25 m"},{"v":8.350000000000001,"d":"8.35 m"},{"v":4.63,"d":"4.63 m"},{"v":4.518,"d":"4.52 m"},{"v":4.07,"d":"4.07 m"},{"v":3.78,"d":"3.78 m"}]
[{"$nulls":12},"577339/9 + 80x60x5",{"v":6.74,"d":"6.74 m"},{"v":8.200000000000001,"d":"8.20 m"},{"v":6.01,"d":"6.01 m"},{"v":7.779999999999999,"d":"7.78 m"},{"v":5.42,"d":"5.42 m"},{"v":7.499999999999998,"d":"7.50 m"},{"v":4.9,"d":"4.90 m"},{"v":7.4,"d":"7.40 m"},{"v":4.4,"d":"4.40 m"},{"$f":"V92-(V92-X92)*(W$84-V$84)/(X$84-V$84)","v":{"v":4.3020000000000005,"d":"4.30 m"}},{"v":3.91,"d":"3.91 m"},{"v":3.7,"d":"3.70 m"},{"$nulls":14},"579504/5 + 100x20",{"v":10.91,"d":"10.91 m"},{"$f":"AO92-(AO92-AQ92)*(AP$82-AO$82)/(AQ$82-AO$82)","v":{"v":13.969999999999999,"d":"13.97 m"}},{"v":9.38,"d":"9.38 m"},{"$f":"AQ92-(AQ92-AS92)*(AR$82-AQ$82)/(AS$82-AQ$82)","v":{"v":12.590000000000002,"d":"12.59 m"}},{"v":8.31,"d":"8.31 m"},{"$f":"AS92-(AS92-AU92)*(AT$82-AS$82)/(AU$82-AS$82)","v":{"v":11.670000000000003,"d":"11.67 m"}},{"v":7.47,"d":"7.47 m"},{"$f":"AU92-(AU92-AW92)*(AV$82-AU$82)/(AW$82-AU$82)","v":{"v":10.97,"d":"10.97 m"}},{"v":6.77,"d":"6.77 m"},{"$f":"AW92-(AW92-AY92)*(AX$82-AW$82)/(AY$82-AW$82)","v":{"v":6.648,"d":"6.65 m"}},{"v":6.16,"d":"6.16 m"},{"v":4.78,"d":"4.78 m"},{"$nulls":14},"579504/5 + 100x20",{"v":11.95,"d":"11.95 m"},{"$f":"BP92-(BP92-BR92)*(BQ$82-BP$82)/(BR$82-BP$82)","v":{"v":15.409999999999997,"d":"15.41 m"}},{"v":10.22,"d":"10.22 m"},{"$f":"BR92-(BR92-BT92)*(BS$82-BR$82)/(BT$82-BR$82)","v":{"v":13.820000000000004,"d":"13.82 m"}},{"v":9.02,"d":"9.02 m"},{"$f":"BT92-(BT92-BV92)*(BU$82-BT$82)/(BV$82-BT$82)","v":{"v":12.66,"d":"12.66 m"}},{"v":8.11,"d":"8.11 m"},{"$f":"BV92-(BV92-BX92)*(BW$82-BV$82)/(BX$82-BV$82)","v":{"v":11.859999999999996,"d":"11.86 m"}},{"v":7.36,"d":"7.36 m"},{"$f":"BX92-(BX92-BZ92)*(BY$82-BX$82)/(BZ$82-BX$82)","v":{"v":7.232,"d":"7.23 m"}},{"v":6.72,"d":"6.72 m"},{"v":5.03,"d":"5.03 m"}]
[{"$nulls":12},"579504/5",{"v":5.55,"d":"5.55 m"},{"v":7.1499999999999995,"d":"7.15 m"},{"v":4.75,"d":"4.75 m"},{"v":6.580000000000001,"d":"6.58 m"},{"v":4.14,"d":"4.14 m"},{"v":6.259999999999999,"d":"6.26 m"},{"v":3.61,"d":"3.61 m"},{"v":6.21,"d":"6.21 m"},{"v":3.09,"d":"3.09 m"},null,null,{"v":3.05,"d":"3.05 m"},{"$nulls":14},"579504/5 + 100x20x3",{"v":9.44,"d":"9.44 m"},{"$f":"AO93-(AO93-AQ93)*(AP$82-AO$82)/(AQ$82-AO$82)","v":{"v":12.499999999999998,"d":"12.50 m"}},{"v":7.91,"d":"7.91 m"},{"$f":"AQ93-(AQ93-AS93)*(AR$82-AQ$82)/(AS$82-AQ$82)","v":{"v":11,"d":"11.00 m"}},{"v":6.88,"d":"6.88 m"},{"$f":"AS93-(AS93-AU93)*(AT$82-AS$82)/(AU$82-AS$82)","v":{"v":10.04,"d":"10.04 m"}},{"v":6.09,"d":"6.09 m"},{"$f":"AU93-(AU93-AW93)*(AV$82-AU$82)/(AW$82-AU$82)","v":{"v":9.339999999999996,"d":"9.34 m"}},{"v":5.44,"d":"5.44 m"},{"$f":"AW93-(AW93-AY93)*(AX$82-AW$82)/(AY$82-AW$82)","v":{"v":5.324,"d":"5.32 m"}},{"v":4.86,"d":"4.86 m"},{"v":4.16,"d":"4.16 m"},{"$nulls":14},"579504/5 + 100x20x3",{"v":10.23,"d":"10.23 m"},{"$f":"BP93-(BP93-BR93)*(BQ$82-BP$82)/(BR$82-BP$82)","v":{"v":13.630000000000003,"d":"13.63 m"}},{"v":8.53,"d":"8.53 m"},{"$f":"BR93-(BR93-BT93)*(BS$82-BR$82)/(BT$82-BR$82)","v":{"v":11.859999999999998,"d":"11.86 m"}},{"v":7.42,"d":"7.42 m"},{"$f":"BT93-(BT93-BV93)*(BU$82-BT$82)/(BV$82-BT$82)","v":{"v":10.78,"d":"10.78 m"}},{"v":6.58,"d":"6.58 m"},{"$f":"BV93-(BV93-BX93)*(BW$82-BV$82)/(BX$82-BV$82)","v":{"v":10.030000000000001,"d":"10.03 m"}},{"v":5.89,"d":"5.89 m"},{"$f":"BX93-(BX93-BZ93)*(BY$82-BX$82)/(BZ$82-BX$82)","v":{"v":5.77,"d":"5.77 m"}},{"v":5.29,"d":"5.29 m"},{"v":4.37,"d":"4.37 m"}]
[{"$nulls":12},"579504/5 + 100x20",{"v":7.09,"d":"7.09 m"},{"$f":"N94-(N94-P94)*(O$84-N$84)/(P$84-N$84)","v":{"v":8.549999999999999,"d":"8.55 m"}},{"v":6.36,"d":"6.36 m"},{"$f":"P94-(P94-R94)*(Q$84-P$84)/(R$84-P$84)","v":{"v":8.100000000000001,"d":"8.10 m"}},{"v":5.78,"d":"5.78 m"},{"$f":"R94-(R94-T94)*(S$84-R$84)/(T$84-R$84)","v":{"v":7.820000000000003,"d":"7.82 m"}},{"v":5.27,"d":"5.27 m"},{"v":7.719999999999996,"d":"7.72 m"},{"v":4.78,"d":"4.78 m"},{"$f":"V94-(V94-X94)*(W$84-V$84)/(X$84-V$84)","v":{"v":4.682,"d":"4.68 m"}},{"v":4.29,"d":"4.29 m"},{"v":3.89,"d":"3.89 m"}]
[{"$nulls":12},"579504/5 + 100x20x3",{"v":6.46,"d":"6.46 m"},{"$f":"N95-(N95-P95)*(O$84-N$84)/(P$84-N$84)","v":{"v":8.04,"d":"8.04 m"}},{"v":5.67,"d":"5.67 m"},{"v":7.500000000000001,"d":"7.50 m"},{"v":5.06,"d":"5.06 m"},{"v":7.179999999999997,"d":"7.18 m"},{"v":4.53,"d":"4.53 m"},{"v":7.080000000000004,"d":"7.08 m"},{"v":4.02,"d":"4.02 m"},{"$f":"V95-(V95-X95)*(W$84-V$84)/(X$84-V$84)","v":{"v":3.9199999999999995,"d":"3.92 m"}},{"v":3.52,"d":"3.52 m"},{"v":3.51,"d":"3.51 m"},{"$nulls":14},"la zul",{"$nulls":26},"la zul"]
[{"$nulls":39},"Gratsparren","l","la zul",{"$nulls":19},"5c) Tabellenwert l",{"$f":"BQ97","v":{"v":7.232,"d":"7.23 m"}},{"$nulls":3},"Gratsparren","l","la zul"]
[{"$nulls":12},"la zul",{"$nulls":26},{"$f":"IF($D$45=\"\",\"\",MATCH($D$45,AN83:AN93))","v":10},{"$f":"IF($D$43>3.5,\"\",MATCH($D$43,AO82:AY82,0))","v":10},{"$f":"IF(OR($D$43=\"\",$D$44=\"\"),0,INDEX(AO83:AY93,AN97,AO97))","v":{"v":6.648,"d":"6.65 m"}},{"$nulls":19},"5c) Korrigierter lzul1",{"$f":"IF($D$43=$D$44,BQ100*BJ88,BQ97*BJ83*BJ84*BJ85*BJ86)","v":{"v":503,"d":"503.00 m"}},{"$nulls":3},{"$f":"IF($D$45=\"\",\"\",MATCH($D$45,BO83:BO93))","v":10},{"$f":"IF($D$43>3.5,\"\",MATCH($D$43,BP82:BZ82,0))","v":10},{"$f":"IF(OR($D$43=\"\",$D$44=\"\"),0,INDEX(BP83:BZ93,BO97,BP97))","v":{"v":7.232,"d":"7.23 m"}}]
[{"$nulls":6},"5a) Tabellenwert l",{"$f":"O99","v":{"v":4.682,"d":"4.68 m"}},{"$nulls":4},"Gratsparren","l","la zul",{"$nulls":18},"5b) Tabellenwert l",{"$f":"AP97","v":{"v":6.648,"d":"6.65 m"}}]
[{"$nulls":6},"5a) Korrigierter lzul1",{"$f":"IF($D$43=$D$44,O102*H90,O99*H85*H86*H87*H88)","v":{"v":3.854831020939829,"d":"3.85 m"}},{"$nulls":4},{"$f":"IF($D$45=\"\",\"\",MATCH($D$45,M85:M95))","v":10},{"$f":"IF($D$43>3.5,\"\",MATCH($D$43,N84:X84,0))","v":10},{"$f":"IF(OR($D$43=\"\",$D$44=\"\"),0,INDEX(N85:X95,M99,N99))","v":{"v":4.682,"d":"4.68 m"}},{"$nulls":18},"5b) Korrigierter lzul1",{"$f":"IF($D$43=$D$44,AP100*AI90,AP97*AI85*AI86*AI87*AI88)","v":{"v":4.712604884774449,"d":"4.71 m"}},{"$nulls":6},"l max",{"$nulls":26},"l max"]
[{"$nulls":41},{"$f":"VLOOKUP($D$45,AN83:AZ93,13)","v":4.78},{"$nulls":26},{"$f":"VLOOKUP($D$45,BO83:CA93,13)","v":5.03}]
[{"$nulls":14},"l max"]
[{"$nulls":14},{"$f":"VLOOKUP($D$45,M85:Y95,13)","v":3.89}]

{"sheet":"Satteldach isoliert","index":2,"n_rows":39,"n_cols":4,"rows_kept":39,"merged":[[3,0,3,5],[18,2,18,5]]}
[null,"Kunde:",null,{"$f":"'Ermittlung Schneelast'!D6","v":{"v":0,"d":"0.00"}}]
[null,"BV:",null,{"$f":"'Ermittlung Schneelast'!D7","v":{"v":0,"d":"0.00"}}]
[]
["Satteldach isoliert, ohne Firstpfette, ohne Zuganker"]
[]
["Nachweis Träger: vereinfachte, überschlägliche Bemessung"]
["lvorh","=",{"$f":"'Ermittlung Schneelast'!_b2","v":{"v":3.5,"d":"3.50 m"}}]
["l1, zul","=",{"$f":"'Bemessungstabelle isoliert'!H19","v":{"v":4.068426,"d":"4.07 m"}}]
["l2, zul","=",{"$f":"'Bemessungstabelle isoliert'!AI19","v":{"v":5.704668000000001,"d":"5.70 m"}}]
["l3, zul","=",{"$f":"'Bemessungstabelle isoliert'!BJ19","v":{"v":62699.99999999999,"d":"62,700.00 m"}}]
["Durchbiegung w","=",{"$f":"'Bemessungstabelle isoliert'!D16","v":{"v":11.313877170879847,"d":"11.3 mm"}}]
["Dachneigung WG","=",{"$f":"'Ermittlung Schneelast'!D18","v":{"v":10,"d":"10.0°"}}]
[]
["Nachweis der vertikalen Durchbiegung"]
["lvorh","<=","l1, zul"]
[{"$f":"C7","v":{"v":3.5,"d":"3.50 m"}},{"$f":"IF(A16<=C16,\"<=\",\">\")","v":"<="},{"$f":"C8","v":{"v":4.068426,"d":"4.07 m"}},{"$f":"IF(A16<=C16,\"Bedingung erfüllt\",\"Bedingung nicht erfüllt!!\")","v":"Bedingung erfüllt"}]
[]
["Nachweis der Spannung im Firstpunkt"]
["Profil und Stahleinschub im Firstbereich","=","579500+100*50*4 auf ganzer Länge +90*40*5 im First"]
["Korrekturfaktor k","=",{"$f":"VLOOKUP(C19,Daten!A63:B73,2)","v":0.9}]
[]
["lvorh","<=","l2, zul * k"]
[{"$f":"C7","v":{"v":3.5,"d":"3.50 m"}},{"$f":"IF(A23<=C23,\"<=\",\">\")","v":"<="},{"$f":"C9*C20","v":{"v":5.134201200000001,"d":"5.13 m"}},{"$f":"IF(A23<=C23,\"Bedingung erfüllt\",\"Bedingung nicht erfüllt!!\")","v":"Bedingung erfüllt"}]
[]
["lvorh","<=","l3, zul * k"]
[{"$f":"C7","v":{"v":3.5,"d":"3.50 m"}},{"$f":"IF(A26<=C26,\"<=\",\">\")","v":"<="},{"$f":"C10*C20","v":{"v":56429.99999999999,"d":"56,430.00 m"}},{"$f":"IF(A26<=C26,\"Bedingung erfüllt\",\"Bedingung nicht erfüllt!!\")","v":"Bedingung erfüllt"}]
[]
["Nachweis der horizontalen Rinnenverschiebung u"]
["Rinnenlänge b","=",{"v":5.2,"d":"5.20 m"}]
["Anzahl Rinnen, die verschiebbar sind","=",{"v":2,"d":"2  Rinne(n)"}]
[]
["u","<=","8 mm oder b/500"]
[{"$f":"IF(C30=2,C11*TAN(C12*PI()/180)*1,IF(C30=1,C11*TAN(C12*PI()/180)*2,\"nicht möglich\"))","v":{"v":1.994941801647673,"d":"2.0 mm"}},{"$f":"IF(A33<=C33,\"<=\",\">\")","v":"<="},{"$f":"IF(8<C29*1000/500,8,C29*1000/500)","v":{"v":8,"d":"8.0 mm"}},{"$f":"IF(A33<=C33,\"Bedingung erfüllt\",\"Bedingung nicht erfüllt!!\")","v":"Bedingung erfüllt"}]
[]
["Nachweis Rinne: vereinfachte, überschlägliche Bemessung der Durchbiegung"]
[]
[{"$f":"'Bemessungstabelle isoliert'!B28","v":{"v":5.1,"d":"5.10 m"}},{"$f":"IF(A37<=C37,\"<=\",\">\")","v":">"},{"$f":"'Bemessungstabelle isoliert'!D28*0.9","v":{"v":2.4824859345,"d":"2.48 m"}},{"$f":"IF(A37<=C37,\"Bedingung erfüllt\",\"Bedingung nicht erfüllt!!\")","v":"Bedingung nicht erfüllt!!"}]
[]
["Berechnungsgrundlage: Skribt \"Schulung am 28.11.2012 bei TS-Aluminium in Großefehn\", Autor Herr Meier-Hedde"]

{"sheet":"Bemessungstabelle unisoliert","index":3,"n_rows":88,"n_cols":92,"rows_kept":88,"merged":[[0,6,0,7],[27,6,27,7],[49,6,49,7],[64,6,64,7]]}
[null,"Kunde:",null,{"$f":"'Ermittlung Schneelast'!D6","v":0},null,null,"1a) Korrekturfaktoren Träger",null,null,"1a) sDA","1a) ki",null,"1a) Träger",{"v":0.5,"d":"0.50 m"},{"$f":"IF(AND($D$12>0.5,$D$12<0.6),$D$12,0)","v":{"v":0,"d":"0.00 m"}},{"v":0.6,"d":"0.60 m"},{"$f":"IF(AND($D$12>0.6,$D$12<0.7),$D$12,0)","v":{"v":0,"d":"0.00 m"}},{"v":0.7,"d":"0.70 m"},{"$f":"IF(AND($D$12>0.7,$D$12<0.8),$D$12,0)","v":{"v":0,"d":"0.00 m"}},{"v":0.8,"d":"0.80 m"},{"$f":"IF(AND($D$12>0.8,$D$12<0.9),$D$12,0)","v":{"v":0.85,"d":"0.85 m"}},{"v":0.9,"d":"0.90 m"},{"$f":"IF(AND($D$12>0.9,$D$12<1),$D$12,0)","v":{"v":0,"d":"0.00 m"}},{"v":1,"d":"1.00 m"},{"$f":"IF(AND($D$12>1,$D$12<1.1),$D$12,0)","v":{"v":0,"d":"0.00 m"}},{"v":1.1,"d":"1.10 m"},{"$nulls":9},"1b) Korrekturfaktoren",null,null,"1b) sDA","1b) ki",null,"1b) Träger",{"v":0.5,"d":"0.50 m"},{"$f":"IF(AND($D$12>0.5,$D$12<0.6),$D$12,0)","v":{"v":0,"d":"0.00 m"}},{"v":0.6,"d":"0.60 m"},{"$f":"IF(AND($D$12>0.6,$D$12<0.7),$D$12,0)","v":{"v":0,"d":"0.00 m"}},{"v":0.7,"d":"0.70 m"},{"$f":"IF(AND($D$12>0.7,$D$12<0.8),$D$12,0)","v":{"v":0,"d":"0.00 m"}},{"v":0.8,"d":"0.80 m"},{"$f":"IF(AND($D$12>0.8,$D$12<0.9),$D$12,0)","v":{"v":0.85,"d":"0.85 m"}},{"v":0.9,"d":"0.90 m"},{"$f":"IF(AND($D$12>0.9,$D$12<1),$D$12,0)","v":{"v":0,"d":"0.00 m"}},{"v":1,"d":"1.00 m"},{"$f":"IF(AND($D$12>1,$D$12<1.1),$D$12,0)","v":{"v":0,"d":"0.00 m"}},{"v":1.1,"d":"1.10 m"},{"$nulls":9},"1c) Korrekturfaktoren",null,null,"1c) sa","1c) ki",null,"1c) Träger",{"v":0.5,"d":"0.50 m"},{"$f":"IF(AND($D$12>0.5,$D$12<0.6),$D$12,0)","v":{"v":0,"d":"0.00 m"}},{"v":0.6,"d":"0.60 m"},{"$f":"IF(AND($D$12>0.6,$D$12<0.7),$D$12,0)","v":{"v":0,"d":"0.00 m"}},{"v":0.7,"d":"0.70 m"},{"$f":"IF(AND($D$12>0.7,$D$12<0.8),$D$12,0)","v":{"v":0,"d":"0.00 m"}},{"v":0.8,"d":"0.80 m"},{"$f":"IF(AND($D$12>0.8,$D$12<0.9),$D$12,0)","v":{"v":0.85,"d":"0.85 m"}},{"v":0.9,"d":"0.90 m"},{"$f":"IF(AND($D$12>0.9,$D$12<1),$D$12,0)","v":{"v":0,"d":"0.00 m"}},{"v":1,"d":"1.00 m"},{"$f":"IF(AND($D$12>1,$D$12<1.1),$D$12,0)","v":{"v":0,"d":"0.00 m"}},{"v":1.1,"d":"1.10 m"}]
[null,"BV:",null,{"$f":"'Ermittlung Schneelast'!D7","v":0},null,null,"1a) Verglasung",{"$f":"VLOOKUP($D$5,Daten!$F$38:$G$43,2)","v":{"v":1,"d":"1.000"}},null,{"v":0.52,"d":"0.52 kN/qm"},1.12,null,"261051",{"v":3.45,"d":"3.45 m"},{"$f":"N2-(N2-P2)*($O$1-$N$1)/($P$1-$N$1)","v":{"v":4.450000000000001,"d":"4.45 m"}},{"v":3.25,"d":"3.25 m"},{"$f":"P2-(P2-R2)*($Q$1-$P$1)/($R$1-$P$1)","v":{"v":4.1499999999999995,"d":"4.15 m"}},{"v":3.1,"d":"3.10 m"},{"$f":"R2-(R2-T2)*($S$1-$R$1)/($T$1-$R$1)","v":{"v":4.08,"d":"4.08 m"}},{"v":2.96,"d":"2.96 m"},{"$f":"T2-(T2-V2)*($U$1-$T$1)/($V$1-$T$1)","v":{"v":2.9050000000000002,"d":"2.91 m"}},{"v":2.85,"d":"2.85 m"},{"$f":"V2-(V2-X2)*($W$1-$V$1)/($X$1-$V$1)","v":{"v":3.750000000000001,"d":"3.75 m"}},{"v":2.75,"d":"2.75 m"},{"$f":"X2-(X2-Z2)*($Y$1-$X$1)/($Z$1-$X$1)","v":{"v":3.55,"d":"3.55 m"}},{"v":2.67,"d":"2.67 m"},{"$nulls":9},"1b) Verglasung",{"$f":"VLOOKUP($D$5,Daten!$F$38:$G$43,2)","v":{"v":1,"d":"1.000"}},null,{"v":0.52,"d":"0.52 kN/qm"},{"v":1.2,"d":"1.20"},null,"261051",{"v":3.9,"d":"3.90 m"},{"$f":"AQ2-(AQ2-AS2)*($O$1-$N$1)/($P$1-$N$1)","v":{"v":5.5,"d":"5.50 m"}},{"v":3.58,"d":"3.58 m"},{"$f":"AS2-(AS2-AU2)*($Q$1-$P$1)/($R$1-$P$1)","v":{"v":5.140000000000002,"d":"5.14 m"}},{"v":3.32,"d":"3.32 m"},{"$f":"AU2-(AU2-AW2)*($S$1-$R$1)/($T$1-$R$1)","v":{"v":4.789999999999998,"d":"4.79 m"}},{"v":3.11,"d":"3.11 m"},{"$f":"AW2-(AW2-AY2)*($U$1-$T$1)/($V$1-$T$1)","v":{"v":3.02,"d":"3.02 m"}},{"v":2.93,"d":"2.93 m"},{"$f":"AY2-(AY2-BA2)*($W$1-$V$1)/($X$1-$V$1)","v":{"v":4.280000000000004,"d":"4.28 m"}},{"v":2.78,"d":"2.78 m"},{"$f":"BA2-(BA2-BC2)*($Y$1-$X$1)/($Z$1-$X$1)","v":{"v":4.079999999999997,"d":"4.08 m"}},{"v":2.65,"d":"2.65 m"},{"$nulls":9},"1c) Verglasung",{"$f":"VLOOKUP($D$5,Daten!$F$38:$G$43,2)","v":{"v":1,"d":"1.000"}},null,{"v":1.196,"d":"1.196 kN/qm"},1.09,null,"261051",{"v":4.44,"d":"4.44 m"},{"$f":"BT2-(BT2-BV2)*($O$1-$N$1)/($P$1-$N$1)","v":{"v":6.290000000000001,"d":"6.29 m"}},{"v":4.07,"d":"4.07 m"},{"$f":"BV2-(BV2-BX2)*($Q$1-$P$1)/($R$1-$P$1)","v":{"v":5.870000000000003,"d":"5.87 m"}},{"v":3.77,"d":"3.77 m"},{"$f":"BX2-(BX2-BZ2)*($S$1-$R$1)/($T$1-$R$1)","v":{"v":5.45,"d":"5.45 m"}},{"v":3.53,"d":"3.53 m"},{"$f":"BZ2-(BZ2-CB2)*($U$1-$T$1)/($V$1-$T$1)","v":{"v":3.43,"d":"3.43 m"}},{"v":3.33,"d":"3.33 m"},{"$f":"CB2-(CB2-CD2)*($W$1-$V$1)/($X$1-$V$1)","v":{"v":4.859999999999999,"d":"4.86 m"}},{"v":3.16,"d":"3.16 m"},{"$f":"CD2-(CD2-CF2)*($Y$1-$X$1)/($Z$1-$X$1)","v":{"v":4.5600000000000005,"d":"4.56 m"}},{"v":3.02,"d":"3.02 m"}]
[{"$nulls":6},"1a) Schnee sDA ",{"$f":"VLOOKUP(D6,J2:K14,2)","v":0.982},null,{"$f":"IF(AND($D$6>J2,$D$6<J4),$D$6,\"nicht interpolieren\")","v":"nicht interpolieren"},{"$f":"K2-(K2-K4)*(J3-J2)/(J4-J2)","v":{"$error":"#VALUE!"}},null,"261051+100x10",{"v":4.84,"d":"4.84 m"},{"v":6.139999999999999,"d":"6.14 m"},{"v":4.58,"d":"4.58 m"},{"v":5.780000000000001,"d":"5.78 m"},{"v":4.38,"d":"4.38 m"},{"v":5.639999999999997,"d":"5.64 m"},{"v":4.2,"d":"4.20 m"},{"v":4.125,"d":"4.13 m"},{"v":4.05,"d":"4.05 m"},{"v":5.219999999999999,"d":"5.22 m"},{"v":3.92,"d":"3.92 m"},{"v":5.019999999999998,"d":"5.02 m"},{"v":3.81,"d":"3.81 m"},{"$nulls":9},"1b) Schnee sDA ",{"$f":"VLOOKUP(D6,AM2:AN17,2)","v":0.974},null,{"$f":"IF(AND($D$6>AM2,$D$6<AM4),$D$6,\"nicht interpolieren\")","v":"nicht interpolieren"},{"$f":"AN2-(AN2-AN4)*(AM3-AM2)/(AM4-AM2)","v":{"$error":"#VALUE!"}},null,"261051+100x10",{"v":6.06,"d":"6.06 m"},{"v":8.459999999999997,"d":"8.46 m"},{"v":5.58,"d":"5.58 m"},{"v":7.859999999999999,"d":"7.86 m"},{"v":5.2,"d":"5.20 m"},{"v":7.370000000000001,"d":"7.37 m"},{"v":4.89,"d":"4.89 m"},{"v":4.76,"d":"4.76 m"},{"v":4.63,"d":"4.63 m"},{"v":6.609999999999998,"d":"6.61 m"},{"v":4.41,"d":"4.41 m"},{"$f":"BA3-(BA3-BC3)*($Y$1-$X$1)/($Z$1-$X$1)","v":{"v":6.41,"d":"6.41 m"}},{"v":4.21,"d":"4.21 m"},{"$nulls":9},"1c) außergewöhnliche Schneelast sa",{"$f":"IF('Ermittlung Schneelast'!D17=\"nein\",10000,VLOOKUP(D7,BP2:BQ15,2))","v":{"v":10000,"d":"10000.000"}},null,{"$f":"IF(AND($D$7>BP2,$D$7<BP4),$D$7,\"nicht interpolieren\")","v":"nicht interpolieren"},{"$f":"BQ2-(BQ2-BQ4)*(BP3-BP2)/(BP4-BP2)","v":{"$error":"#VALUE!"}},null,"261051+100x10",{"v":6.87,"d":"6.87 m"},{"v":9.42,"d":"9.42 m"},{"v":6.36,"d":"6.36 m"},{"v":9.000000000000004,"d":"9.00 m"},{"v":5.92,"d":"5.92 m"},{"v":8.369999999999996,"d":"8.37 m"},{"v":5.57,"d":"5.57 m"},{"v":5.42,"d":"5.42 m"},{"v":5.27,"d":"5.27 m"},{"v":7.609999999999998,"d":"7.61 m"},{"v":5.01,"d":"5.01 m"},{"v":7.2099999999999955,"d":"7.21 m"},{"v":4.79,"d":"4.79 m"}]
[null,"Bemessungstabelle: Pos. 1.1 Mittelträger unisoliert",{"$nulls":4},"1a) Wind",{"$f":"VLOOKUP($D$8,Daten!$A$50:$B$57,2)","v":{"v":1,"d":"1.000"}},null,{"v":0.75,"d":"0.75 kN/qm"},1.06,null,"261052",{"v":4.08,"d":"4.08 m"},{"v":5.23,"d":"5.23 m"},{"v":3.85,"d":"3.85 m"},{"v":4.9300000000000015,"d":"4.93 m"},{"v":3.67,"d":"3.67 m"},{"v":4.79,"d":"4.79 m"},{"v":3.51,"d":"3.51 m"},{"v":3.445,"d":"3.45 m"},{"v":3.38,"d":"3.38 m"},{"v":4.460000000000001,"d":"4.46 m"},{"v":3.26,"d":"3.26 m"},{"v":4.259999999999995,"d":"4.26 m"},{"v":3.16,"d":"3.16 m"},{"$nulls":9},"1b) Wind",{"$f":"VLOOKUP($D$8,Daten!$A$50:$C$57,3)","v":{"v":1,"d":"1.000"}},null,{"v":0.75,"d":"0.75 kN/qm"},1.09,null,"261052",{"v":5.37,"d":"5.37 m"},{"v":7.620000000000001,"d":"7.62 m"},{"v":4.92,"d":"4.92 m"},{"v":7.080000000000002,"d":"7.08 m"},{"v":4.56,"d":"4.56 m"},{"v":6.519999999999993,"d":"6.52 m"},{"v":4.28,"d":"4.28 m"},{"v":4.16,"d":"4.16 m"},{"v":4.04,"d":"4.04 m"},{"v":5.93,"d":"5.93 m"},{"v":3.83,"d":"3.83 m"},{"v":5.529999999999998,"d":"5.53 m"},{"v":3.66,"d":"3.66 m"},{"$nulls":9},"1c) Wind",{"v":1,"d":"1.000"},null,{"v":1.5,"d":"1.50 kN/qm"},{"v":1,"d":"1.00"},null,"261052",{"v":6.11,"d":"6.11 m"},{"v":8.710000000000003,"d":"8.71 m"},{"v":5.59,"d":"5.59 m"},{"v":7.989999999999997,"d":"7.99 m"},{"v":5.19,"d":"5.19 m"},{"v":7.499999999999998,"d":"7.50 m"},{"v":4.86,"d":"4.86 m"},{"v":4.7250000000000005,"d":"4.73 m"},{"v":4.59,"d":"4.59 m"},{"v":6.659999999999997,"d":"6.66 m"},{"v":4.36,"d":"4.36 m"},{"v":6.36,"d":"6.36 m"},{"v":4.16,"d":"4.16 m"}]
[null,"Dachlast gDa","=","10mm VSG",null,null,"1a) Dachneigung",{"$f":"VLOOKUP($D$9,J17:K22,2)","v":{"v":1,"d":"1.000"}},null,{"$f":"IF(AND($D$6>J4,$D$6<J6),$D$6,\"nicht interpolieren\")","v":"nicht interpolieren"},{"$f":"K4-(K4-K6)*(J5-J4)/(J6-J4)","v":{"$error":"#VALUE!"}},null,"261052+80x10",{"v":4.68,"d":"4.68 m"},{"v":5.93,"d":"5.93 m"},{"v":4.43,"d":"4.43 m"},{"v":5.6299999999999955,"d":"5.63 m"},{"v":4.23,"d":"4.23 m"},{"v":5.420000000000005,"d":"5.42 m"},{"v":4.06,"d":"4.06 m"},{"v":3.985,"d":"3.99 m"},{"v":3.91,"d":"3.91 m"},{"v":5.080000000000004,"d":"5.08 m"},{"v":3.78,"d":"3.78 m"},{"v":4.879999999999997,"d":"4.88 m"},{"v":3.67,"d":"3.67 m"},{"$nulls":9},"1b) Dachneigung",{"$f":"VLOOKUP($D$9,AM20:AN25,2)","v":{"v":1,"d":"1.000"}},null,{"$f":"IF(AND($D$6>AM4,$D$6<AM6),$D$6,\"nicht interpolieren\")","v":"nicht interpolieren"},{"$f":"AN4-(AN4-AN6)*(AM5-AM4)/(AM6-AM4)","v":{"$error":"#VALUE!"}},null,"261052+80x10",{"v":6.43,"d":"6.43 m"},{"v":8.979999999999999,"d":"8.98 m"},{"v":5.92,"d":"5.92 m"},{"v":8.320000000000002,"d":"8.32 m"},{"v":5.52,"d":"5.52 m"},{"v":7.829999999999991,"d":"7.83 m"},{"v":5.19,"d":"5.19 m"},{"v":5.050000000000001,"d":"5.05 m"},{"v":4.91,"d":"4.91 m"},{"v":7.070000000000002,"d":"7.07 m"},{"v":4.67,"d":"4.67 m"},{"v":6.769999999999998,"d":"6.77 m"},{"v":4.46,"d":"4.46 m"},{"$nulls":9},"1c) Dachneigung",{"$f":"VLOOKUP($D$9,BP18:BQ23,2)","v":{"v":1,"d":"1.000"}},null,{"$f":"IF(AND($D$7>BP4,$D$7<BP6),$D$7,\"nicht interpolieren\")","v":"nicht interpolieren"},{"$f":"BQ4-(BQ4-BQ6)*(BP5-BP4)/(BP6-BP4)","v":{"$error":"#VALUE!"}},null,"261052+80x10",{"v":7.33,"d":"7.33 m"},{"v":10.28,"d":"10.28 m"},{"v":6.74,"d":"6.74 m"},{"v":9.5,"d":"9.50 m"},{"v":6.28,"d":"6.28 m"},{"v":8.939999999999998,"d":"8.94 m"},{"v":5.9,"d":"5.90 m"},{"v":5.745,"d":"5.75 m"},{"v":5.59,"d":"5.59 m"},{"v":8.110000000000003,"d":"8.11 m"},{"v":5.31,"d":"5.31 m"},{"v":7.609999999999992,"d":"7.61 m"},{"v":5.08,"d":"5.08 m"}]
[null,"normale Schneelast sDa","=",{"$f":"'Ermittlung Schneelast'!D53","v":{"v":1.1,"d":"1.100 kN/qm"}},null,null,"zul. Durchbiegung",{"$f":"VLOOKUP($D$13,Daten!$A$44:$B$47,2)","v":{"v":1,"d":"1.000"}},null,{"v":1,"d":"1.00 kN/qm"},{"v":1,"d":"1.00"},null,"261071",{"v":4.62,"d":"4.62 m"},{"v":5.919999999999999,"d":"5.92 m"},{"v":4.36,"d":"4.36 m"},{"v":5.62,"d":"5.62 m"},{"v":4.15,"d":"4.15 m"},{"v":5.41,"d":"5.41 m"},{"v":3.97,"d":"3.97 m"},{"v":3.895,"d":"3.90 m"},{"v":3.82,"d":"3.82 m"},{"v":4.989999999999999,"d":"4.99 m"},{"v":3.69,"d":"3.69 m"},{"v":4.789999999999997,"d":"4.79 m"},{"v":3.58,"d":"3.58 m"},{"$nulls":9},"zul. Durchbiegung",{"$f":"VLOOKUP($D$13,Daten!$A$44:$B$47,2)","v":{"v":1,"d":"1.000"}},null,{"v":1,"d":"1.00 kN/qm"},{"v":1,"d":"1.00"},null,"261071",{"v":5.42,"d":"5.42 m"},{"v":7.670000000000002,"d":"7.67 m"},{"v":4.97,"d":"4.97 m"},{"v":7.129999999999997,"d":"7.13 m"},{"v":4.61,"d":"4.61 m"},{"v":6.639999999999999,"d":"6.64 m"},{"v":4.32,"d":"4.32 m"},{"v":4.2,"d":"4.20 m"},{"v":4.08,"d":"4.08 m"},{"v":5.970000000000001,"d":"5.97 m"},{"v":3.87,"d":"3.87 m"},{"v":5.67,"d":"5.67 m"},{"v":3.69,"d":"3.69 m"},{"$nulls":9},"zul. Durchbiegung",{"$f":"VLOOKUP($D$13,Daten!$A$44:$B$47,2)","v":{"v":1,"d":"1.000"}},null,{"v":2,"d":"2.00 kN/qm"},0.88,null,"261071",{"v":6.17,"d":"6.17 m"},{"v":8.769999999999998,"d":"8.77 m"},{"v":5.65,"d":"5.65 m"},{"v":8.110000000000001,"d":"8.11 m"},{"v":5.24,"d":"5.24 m"},{"v":7.549999999999999,"d":"7.55 m"},{"v":4.91,"d":"4.91 m"},{"v":4.7700000000000005,"d":"4.77 m"},{"v":4.63,"d":"4.63 m"},{"v":6.699999999999996,"d":"6.70 m"},{"v":4.4,"d":"4.40 m"},{"v":6.4,"d":"6.40 m"},{"v":4.2,"d":"4.20 m"}]
[null,"außergewöhnliche Schneelast sa","=",{"$f":"'Ermittlung Schneelast'!D54","v":"nur erforderlich für Norddeutsches Tiefland"},{"$nulls":5},{"$f":"IF(AND($D$6>J6,$D$6<J8),$D$6,\"nicht interpolieren\")","v":{"v":1.1,"d":"1.10 kN/qm"}},{"$f":"K6-(K6-K8)*(J7-J6)/(J8-J6)","v":{"v":0.982,"d":"0.98"}},null,"261071+100x10",{"v":5.48,"d":"5.48 m"},{"v":6.880000000000002,"d":"6.88 m"},{"v":5.2,"d":"5.20 m"},{"v":6.6400000000000015,"d":"6.64 m"},{"v":4.96,"d":"4.96 m"},{"v":6.290000000000001,"d":"6.29 m"},{"v":4.77,"d":"4.77 m"},{"v":4.685,"d":"4.69 m"},{"v":4.6,"d":"4.60 m"},{"v":5.949999999999996,"d":"5.95 m"},{"v":4.45,"d":"4.45 m"},{"v":5.749999999999998,"d":"5.75 m"},{"v":4.32,"d":"4.32 m"},{"$nulls":12},{"$f":"IF(AND($D$6>AM6,$D$6<AM8),$D$6,\"nicht interpolieren\")","v":{"v":1.1,"d":"1.10 kN/qm"}},{"$f":"AN6-(AN6-AN8)*(AM7-AM6)/(AM8-AM6)","v":{"v":0.974,"d":"0.97"}},null,"261071+100x10",{"v":7.04,"d":"7.04 m"},{"v":9.79,"d":"9.79 m"},{"v":6.49,"d":"6.49 m"},{"v":9.070000000000004,"d":"9.07 m"},{"v":6.06,"d":"6.06 m"},{"v":8.579999999999993,"d":"8.58 m"},{"v":5.7,"d":"5.70 m"},{"v":5.545,"d":"5.55 m"},{"v":5.39,"d":"5.39 m"},{"v":7.729999999999999,"d":"7.73 m"},{"v":5.13,"d":"5.13 m"},{"v":7.329999999999996,"d":"7.33 m"},{"v":4.91,"d":"4.91 m"},{"$nulls":12},{"$f":"IF(AND($D$7>BP6,$D$7<BP8),$D$7,\"nicht interpolieren\")","v":"nicht interpolieren"},{"$f":"BQ6-(BQ6-BQ8)*(BP7-BP6)/(BP8-BP6)","v":{"$error":"#VALUE!"}},null,"261071+100x10",{"v":8.02,"d":"8.02 m"},{"v":11.119999999999997,"d":"11.12 m"},{"v":7.4,"d":"7.40 m"},{"v":10.460000000000004,"d":"10.46 m"},{"v":6.89,"d":"6.89 m"},{"v":9.759999999999991,"d":"9.76 m"},{"v":6.48,"d":"6.48 m"},{"v":6.3100000000000005,"d":"6.31 m"},{"v":6.14,"d":"6.14 m"},{"v":8.84,"d":"8.84 m"},{"v":5.84,"d":"5.84 m"},{"v":8.339999999999998,"d":"8.34 m"},{"v":5.59,"d":"5.59 m"}]
[null,"Windzone WZ","=",{"$f":"'Ermittlung Schneelast'!D11:F11","v":"1, Binnenland"},{"$nulls":5},{"v":1.5,"d":"1.50 kN/qm"},0.91,null,"261072",{"v":5.32,"d":"5.32 m"},{"v":6.820000000000004,"d":"6.82 m"},{"v":5.02,"d":"5.02 m"},{"v":6.4599999999999955,"d":"6.46 m"},{"v":4.78,"d":"4.78 m"},{"v":6.18,"d":"6.18 m"},{"v":4.58,"d":"4.58 m"},{"v":4.495,"d":"4.50 m"},{"v":4.41,"d":"4.41 m"},{"v":5.760000000000003,"d":"5.76 m"},{"v":4.26,"d":"4.26 m"},{"v":5.559999999999998,"d":"5.56 m"},{"v":4.13,"d":"4.13 m"},{"$nulls":12},{"v":1.5,"d":"1.50 kN/qm"},0.87,null,"261072",{"v":7.31,"d":"7.31 m"},{"v":10.309999999999999,"d":"10.31 m"},{"v":6.71,"d":"6.71 m"},{"v":9.589999999999998,"d":"9.59 m"},{"v":6.23,"d":"6.23 m"},{"v":8.96,"d":"8.96 m"},{"v":5.84,"d":"5.84 m"},{"v":5.675,"d":"5.68 m"},{"v":5.51,"d":"5.51 m"},{"v":7.939999999999997,"d":"7.94 m"},{"v":5.24,"d":"5.24 m"},{"v":7.640000000000001,"d":"7.64 m"},{"v":5,"d":"5.00 m"},{"$nulls":12},{"v":2.5,"d":"2.50 kN/qm"},{"v":0.8,"d":"0.80"},null,"261072",{"v":8.32,"d":"8.32 m"},{"v":11.770000000000003,"d":"11.77 m"},{"v":7.63,"d":"7.63 m"},{"v":10.93,"d":"10.93 m"},{"v":7.08,"d":"7.08 m"},{"v":10.16,"d":"10.16 m"},{"v":6.64,"d":"6.64 m"},{"v":6.455,"d":"6.46 m"},{"v":6.27,"d":"6.27 m"},{"v":9.059999999999997,"d":"9.06 m"},{"v":5.96,"d":"5.96 m"},{"v":8.659999999999993,"d":"8.66 m"},{"v":5.69,"d":"5.69 m"}]
[null,"Dachneigung WG","=",{"$f":"'Ermittlung Schneelast'!D18","v":{"v":10,"d":"10.0°"}},{"$nulls":5},{"$f":"IF(AND($D$6>J8,$D$6<J10),$D$6,\"nicht interpolieren\")","v":"nicht interpolieren"},{"$f":"K8-(K8-K10)*(J9-J8)/(J10-J8)","v":{"$error":"#VALUE!"}},null,"261072+100x10",{"v":5.96,"d":"5.96 m"},{"v":7.509999999999998,"d":"7.51 m"},{"v":5.65,"d":"5.65 m"},{"v":7.15,"d":"7.15 m"},{"v":5.4,"d":"5.40 m"},{"v":6.940000000000003,"d":"6.94 m"},{"v":5.18,"d":"5.18 m"},{"v":5.09,"d":"5.09 m"},{"v":5,"d":"5.00 m"},{"v":6.440000000000001,"d":"6.44 m"},{"v":4.84,"d":"4.84 m"},{"v":6.239999999999995,"d":"6.24 m"},{"v":4.7,"d":"4.70 m"},{"$nulls":12},{"$f":"IF(AND($D$6>AM8,$D$6<AM13),$D$6,\"nicht interpolieren\")","v":"nicht interpolieren"},{"$f":"AN8-(AN8-AN13)*(AM9-AM8)/(AM13-AM8)","v":{"$error":"#VALUE!"}},null,"261072+100x10",{"v":8.28,"d":"8.28 m"},{"v":11.479999999999999,"d":"11.48 m"},{"v":7.64,"d":"7.64 m"},{"v":10.7,"d":"10.70 m"},{"v":7.13,"d":"7.13 m"},{"v":10.069999999999997,"d":"10.07 m"},{"v":6.71,"d":"6.71 m"},{"v":6.535,"d":"6.54 m"},{"v":6.36,"d":"6.36 m"},{"v":9.060000000000008,"d":"9.06 m"},{"v":6.06,"d":"6.06 m"},{"v":8.759999999999993,"d":"8.76 m"},{"v":5.79,"d":"5.79 m"},{"$nulls":12},{"$f":"IF(AND($D$7>BP8,$D$7<BP13),$D$7,\"nicht interpolieren\")","v":"nicht interpolieren"},{"$f":"BQ8-(BQ8-BQ13)*(BP9-BP8)/(BP13-BP8)","v":{"$error":"#VALUE!"}},null,"261072+100x10",{"v":9.44,"d":"9.44 m"},{"v":13.089999999999993,"d":"13.09 m"},{"v":8.71,"d":"8.71 m"},{"v":12.25000000000001,"d":"12.25 m"},{"v":8.12,"d":"8.12 m"},{"v":11.479999999999993,"d":"11.48 m"},{"v":7.64,"d":"7.64 m"},{"v":7.44,"d":"7.44 m"},{"v":7.24,"d":"7.24 m"},{"v":10.390000000000006,"d":"10.39 m"},{"v":6.89,"d":"6.89 m"},{"v":9.889999999999995,"d":"9.89 m"},{"v":6.59,"d":"6.59 m"}]
[null,"Tiefe WG b2","=",{"$f":"'Ermittlung Schneelast'!_b2","v":{"v":3.5,"d":"3.50 m"}},{"$nulls":5},{"v":2,"d":"2.00 kN/qm"},0.84,null,"5415140",{"v":3.89,"d":"3.89 m"},{"$f":"N10-(N10-P10)*($O$1-$N$1)/($P$1-$N$1)","v":{"v":4.990000000000001,"d":"4.99 m"}},{"v":3.67,"d":"3.67 m"},{"$f":"P10-(P10-R10)*($Q$1-$P$1)/($R$1-$P$1)","v":{"v":4.749999999999998,"d":"4.75 m"}},{"v":3.49,"d":"3.49 m"},{"$f":"R10-(R10-T10)*($S$1-$R$1)/($T$1-$R$1)","v":{"v":4.540000000000002,"d":"4.54 m"}},{"v":3.34,"d":"3.34 m"},{"$f":"T10-(T10-V10)*($U$1-$T$1)/($V$1-$T$1)","v":{"v":3.2800000000000002,"d":"3.28 m"}},{"v":3.22,"d":"3.22 m"},{"$f":"V10-(V10-X10)*($W$1-$V$1)/($X$1-$V$1)","v":{"v":4.2100000000000035,"d":"4.21 m"}},{"v":3.11,"d":"3.11 m"},{"$f":"X10-(X10-Z10)*($Y$1-$X$1)/($Z$1-$X$1)","v":{"v":4.109999999999999,"d":"4.11 m"}},{"v":3.01,"d":"3.01 m"},{"$nulls":15},"5415140",{"v":5.23,"d":"5.23 m"},{"$f":"AQ10-(AQ10-AS10)*($O$1-$N$1)/($P$1-$N$1)","v":{"v":7.430000000000003,"d":"7.43 m"}},{"v":4.79,"d":"4.79 m"},{"$f":"AS10-(AS10-AU10)*($Q$1-$P$1)/($R$1-$P$1)","v":{"v":6.889999999999999,"d":"6.89 m"}},{"v":4.44,"d":"4.44 m"},{"$f":"AU10-(AU10-AW10)*($S$1-$R$1)/($T$1-$R$1)","v":{"v":6.4,"d":"6.40 m"}},{"v":4.16,"d":"4.16 m"},{"$f":"AW10-(AW10-AY10)*($U$1-$T$1)/($V$1-$T$1)","v":{"v":4.04,"d":"4.04 m"}},{"v":3.92,"d":"3.92 m"},{"$f":"AY10-(AY10-BA10)*($W$1-$V$1)/($X$1-$V$1)","v":{"v":5.63,"d":"5.63 m"}},{"v":3.73,"d":"3.73 m"},{"$f":"BA10-(BA10-BC10)*($Y$1-$X$1)/($Z$1-$X$1)","v":{"v":5.429999999999998,"d":"5.43 m"}},{"v":3.56,"d":"3.56 m"},{"$nulls":15},"5415140",{"v":5.95,"d":"5.95 m"},{"$f":"BT10-(BT10-BV10)*($O$1-$N$1)/($P$1-$N$1)","v":{"v":8.5,"d":"8.50 m"}},{"v":5.44,"d":"5.44 m"},{"$f":"BV10-(BV10-BX10)*($Q$1-$P$1)/($R$1-$P$1)","v":{"v":7.780000000000005,"d":"7.78 m"}},{"v":5.05,"d":"5.05 m"},{"$f":"BX10-(BX10-BZ10)*($S$1-$R$1)/($T$1-$R$1)","v":{"v":7.289999999999994,"d":"7.29 m"}},{"v":4.73,"d":"4.73 m"},{"$f":"BZ10-(BZ10-CB10)*($U$1-$T$1)/($V$1-$T$1)","v":{"v":4.595000000000001,"d":"4.60 m"}},{"v":4.46,"d":"4.46 m"},{"$f":"CB10-(CB10-CD10)*($W$1-$V$1)/($X$1-$V$1)","v":{"v":6.439999999999998,"d":"6.44 m"}},{"v":4.24,"d":"4.24 m"},{"$f":"CD10-(CD10-CF10)*($Y$1-$X$1)/($Z$1-$X$1)","v":{"v":6.24,"d":"6.24 m"}},{"v":4.04,"d":"4.04 m"}]
[null,"Träger","=","5415140",{"$nulls":5},{"$f":"IF(AND($D$6>J10,$D$6<J12),$D$6,\"nicht interpolieren\")","v":"nicht interpolieren"},{"$f":"K10-(K10-K12)*(J11-J10)/(J12-J10)","v":{"$error":"#VALUE!"}},null,"5415140+70x30x3",{"v":4.4,"d":"4.40 m"},{"$f":"N11-(N11-P11)*($O$1-$N$1)/($P$1-$N$1)","v":{"v":5.600000000000001,"d":"5.60 m"}},{"v":4.16,"d":"4.16 m"},{"$f":"P11-(P11-R11)*($Q$1-$P$1)/($R$1-$P$1)","v":{"v":5.360000000000001,"d":"5.36 m"}},{"v":3.96,"d":"3.96 m"},{"$f":"R11-(R11-T11)*($S$1-$R$1)/($T$1-$R$1)","v":{"v":5.08,"d":"5.08 m"}},{"v":3.8,"d":"3.80 m"},{"$f":"T11-(T11-V11)*($U$1-$T$1)/($V$1-$T$1)","v":{"v":3.73,"d":"3.73 m"}},{"v":3.66,"d":"3.66 m"},{"$f":"V11-(V11-X11)*($W$1-$V$1)/($X$1-$V$1)","v":{"v":4.740000000000001,"d":"4.74 m"}},{"v":3.54,"d":"3.54 m"},{"$f":"X11-(X11-Z11)*($Y$1-$X$1)/($Z$1-$X$1)","v":{"v":4.639999999999998,"d":"4.64 m"}},{"v":3.43,"d":"3.43 m"},{"$nulls":15},"5415140+70x30x3",{"v":6.26,"d":"6.26 m"},{"$f":"AQ11-(AQ11-AS11)*($O$1-$N$1)/($P$1-$N$1)","v":{"v":8.809999999999999,"d":"8.81 m"}},{"v":5.75,"d":"5.75 m"},{"$f":"AS11-(AS11-AU11)*($Q$1-$P$1)/($R$1-$P$1)","v":{"v":8.150000000000002,"d":"8.15 m"}},{"v":5.35,"d":"5.35 m"},{"$f":"AU11-(AU11-AW11)*($S$1-$R$1)/($T$1-$R$1)","v":{"v":7.659999999999998,"d":"7.66 m"}},{"v":5.02,"d":"5.02 m"},{"$f":"AW11-(AW11-AY11)*($U$1-$T$1)/($V$1-$T$1)","v":{"v":4.885,"d":"4.89 m"}},{"v":4.75,"d":"4.75 m"},{"$f":"AY11-(AY11-BA11)*($W$1-$V$1)/($X$1-$V$1)","v":{"v":6.820000000000004,"d":"6.82 m"}},{"v":4.52,"d":"4.52 m"},{"$f":"BA11-(BA11-BC11)*($Y$1-$X$1)/($Z$1-$X$1)","v":{"v":6.619999999999997,"d":"6.62 m"}},{"v":4.31,"d":"4.31 m"},{"$nulls":15},"5415140+70x30x3",{"v":7.13,"d":"7.13 m"},{"$f":"BT11-(BT11-BV11)*($O$1-$N$1)/($P$1-$N$1)","v":{"v":10.030000000000001,"d":"10.03 m"}},{"v":6.55,"d":"6.55 m"},{"$f":"BV11-(BV11-BX11)*($Q$1-$P$1)/($R$1-$P$1)","v":{"v":9.31,"d":"9.31 m"}},{"v":6.09,"d":"6.09 m"},{"$f":"BX11-(BX11-BZ11)*($S$1-$R$1)/($T$1-$R$1)","v":{"v":8.679999999999998,"d":"8.68 m"}},{"v":5.72,"d":"5.72 m"},{"$f":"BZ11-(BZ11-CB11)*($U$1-$T$1)/($V$1-$T$1)","v":{"v":5.5600000000000005,"d":"5.56 m"}},{"v":5.4,"d":"5.40 m"},{"$f":"CB11-(CB11-CD11)*($W$1-$V$1)/($X$1-$V$1)","v":{"v":7.740000000000007,"d":"7.74 m"}},{"v":5.14,"d":"5.14 m"},{"$f":"CD11-(CD11-CF11)*($Y$1-$X$1)/($Z$1-$X$1)","v":{"v":7.439999999999992,"d":"7.44 m"}},{"v":4.91,"d":"4.91 m"}]
[null,"Achsabstand","=",{"v":0.85,"d":"0.85  m"},{"$f":"IF(OR(D12<0.5,D12>1.1),\"Achtung: Trägerabstand muss zwischen 0,50 m und 1,10 m betragen!\",\"\")","v":""},{"$nulls":4},{"v":2.5,"d":"2.50 kN/qm"},{"v":0.8,"d":"0.80"},null,"5415140+Z-Profil",{"v":5.19,"d":"5.19 m"},{"v":6.590000000000002,"d":"6.59 m"},{"v":4.91,"d":"4.91 m"},{"v":6.290000000000003,"d":"6.29 m"},{"v":4.68,"d":"4.68 m"},{"v":6.0099999999999945,"d":"6.01 m"},{"v":4.49,"d":"4.49 m"},{"v":4.41,"d":"4.41 m"},{"v":4.33,"d":"4.33 m"},{"v":5.680000000000003,"d":"5.68 m"},{"v":4.18,"d":"4.18 m"},{"v":5.38,"d":"5.38 m"},{"v":4.06,"d":"4.06 m"},{"$nulls":15},"5415140+Z-Profil",{"v":6.42,"d":"6.42 m"},{"v":9.019999999999998,"d":"9.02 m"},{"v":5.9,"d":"5.90 m"},{"v":8.360000000000001,"d":"8.36 m"},{"v":5.49,"d":"5.49 m"},{"v":7.869999999999997,"d":"7.87 m"},{"v":5.15,"d":"5.15 m"},{"v":5.010000000000001,"d":"5.01 m"},{"v":4.87,"d":"4.87 m"},{"v":7.030000000000003,"d":"7.03 m"},{"v":4.63,"d":"4.63 m"},{"v":6.729999999999998,"d":"6.73 m"},{"v":4.42,"d":"4.42 m"},{"$nulls":15},"5415140+Z-Profil",{"v":7.31,"d":"7.31 m"},{"v":10.309999999999999,"d":"10.31 m"},{"v":6.71,"d":"6.71 m"},{"v":9.53,"d":"9.53 m"},{"v":6.24,"d":"6.24 m"},{"v":8.899999999999997,"d":"8.90 m"},{"v":5.86,"d":"5.86 m"},{"v":5.7,"d":"5.70 m"},{"v":5.54,"d":"5.54 m"},{"v":7.970000000000004,"d":"7.97 m"},{"v":5.27,"d":"5.27 m"},{"v":7.669999999999991,"d":"7.67 m"},{"v":5.03,"d":"5.03 m"}]
[null,"zul. Durchbiegung","=","l/200","Info",{"$nulls":4},{"$f":"IF(AND($D$6>J12,$D$6<J14),$D$6,\"nicht interpolieren\")","v":"nicht interpolieren"},{"$f":"K12-(K12-K14)*(J13-J12)/(J14-J12)","v":{"$error":"#VALUE!"}},null,"5415141",{"v":3.59,"d":"3.59 m"},{"$f":"N13-(N13-P13)*($O$1-$N$1)/($P$1-$N$1)","v":{"v":4.64,"d":"4.64 m"}},{"v":3.38,"d":"3.38 m"},{"$f":"P13-(P13-R13)*($Q$1-$P$1)/($R$1-$P$1)","v":{"v":4.339999999999998,"d":"4.34 m"}},{"v":3.22,"d":"3.22 m"},{"$f":"R13-(R13-T13)*($S$1-$R$1)/($T$1-$R$1)","v":{"v":4.2,"d":"4.20 m"}},{"v":3.08,"d":"3.08 m"},{"$f":"T13-(T13-V13)*($U$1-$T$1)/($V$1-$T$1)","v":{"v":3.02,"d":"3.02 m"}},{"v":2.96,"d":"2.96 m"},{"$f":"V13-(V13-X13)*($W$1-$V$1)/($X$1-$V$1)","v":{"v":3.860000000000001,"d":"3.86 m"}},{"v":2.86,"d":"2.86 m"},{"$f":"X13-(X13-Z13)*($Y$1-$X$1)/($Z$1-$X$1)","v":{"v":3.7599999999999976,"d":"3.76 m"}},{"v":2.77,"d":"2.77 m"},{"$nulls":12},{"v":2,"d":"2.00 kN/qm"},0.78,null,"5415141",{"v":4.38,"d":"4.38 m"},{"$f":"AQ13-(AQ13-AS13)*($O$1-$N$1)/($P$1-$N$1)","v":{"v":6.23,"d":"6.23 m"}},{"v":4.01,"d":"4.01 m"},{"$f":"AS13-(AS13-AU13)*($Q$1-$P$1)/($R$1-$P$1)","v":{"v":5.749999999999997,"d":"5.75 m"}},{"v":3.72,"d":"3.72 m"},{"$f":"AU13-(AU13-AW13)*($S$1-$R$1)/($T$1-$R$1)","v":{"v":5.4,"d":"5.40 m"}},{"v":3.48,"d":"3.48 m"},{"$f":"AW13-(AW13-AY13)*($U$1-$T$1)/($V$1-$T$1)","v":{"v":3.3850000000000002,"d":"3.39 m"}},{"v":3.29,"d":"3.29 m"},{"$f":"AY13-(AY13-BA13)*($W$1-$V$1)/($X$1-$V$1)","v":{"v":4.82,"d":"4.82 m"}},{"v":3.12,"d":"3.12 m"},{"$f":"BA13-(BA13-BC13)*($Y$1-$X$1)/($Z$1-$X$1)","v":{"v":4.52,"d":"4.52 m"}},{"v":2.98,"d":"2.98 m"},{"$nulls":12},{"v":3,"d":"3.00 kN/qm"},0.74,null,"5415141",{"v":4.98,"d":"4.98 m"},{"$f":"BT13-(BT13-BV13)*($O$1-$N$1)/($P$1-$N$1)","v":{"v":7.080000000000005,"d":"7.08 m"}},{"v":4.56,"d":"4.56 m"},{"$f":"BV13-(BV13-BX13)*($Q$1-$P$1)/($R$1-$P$1)","v":{"v":6.539999999999996,"d":"6.54 m"}},{"v":4.23,"d":"4.23 m"},{"$f":"BX13-(BX13-BZ13)*($S$1-$R$1)/($T$1-$R$1)","v":{"v":6.120000000000002,"d":"6.12 m"}},{"v":3.96,"d":"3.96 m"},{"$f":"BZ13-(BZ13-CB13)*($U$1-$T$1)/($V$1-$T$1)","v":{"v":3.85,"d":"3.85 m"}},{"v":3.74,"d":"3.74 m"},{"$f":"CB13-(CB13-CD13)*($W$1-$V$1)/($X$1-$V$1)","v":{"v":5.450000000000004,"d":"5.45 m"}},{"v":3.55,"d":"3.55 m"},{"$f":"CD13-(CD13-CF13)*($Y$1-$X$1)/($Z$1-$X$1)","v":{"v":5.249999999999997,"d":"5.25 m"}},{"v":3.38,"d":"3.38 m"}]
[null,{"$f":"D10","v":{"v":3.5,"d":"3.50 m"}},{"$f":"IF(B14<D14,\"<\",\">\")","v":">"},{"$f":"MIN(H15,AK22,BN22)","v":{"v":3.2209600000000003,"d":"3.22 m"}},null,null,"1a) Tabellenwert l",{"$f":"O28","v":{"v":3.2800000000000002,"d":"3.28 m"}},null,{"v":3,"d":"3.00 kN/qm"},0.76,null,"5415141+110x15",{"v":5.67,"d":"5.67 m"},{"v":7.070000000000001,"d":"7.07 m"},{"v":5.39,"d":"5.39 m"},{"v":6.769999999999997,"d":"6.77 m"},{"v":5.16,"d":"5.16 m"},{"v":6.5600000000000005,"d":"6.56 m"},{"v":4.96,"d":"4.96 m"},{"v":4.875,"d":"4.88 m"},{"v":4.79,"d":"4.79 m"},{"v":6.140000000000003,"d":"6.14 m"},{"v":4.64,"d":"4.64 m"},{"v":6.039999999999996,"d":"6.04 m"},{"v":4.5,"d":"4.50 m"},{"$nulls":12},{"$f":"IF(AND($D$6>AM13,$D$6<AM15),$D$6,\"nicht interpolieren\")","v":"nicht interpolieren"},{"$f":"AN13-(AN13-AN15)*(AM14-AM13)/(AM15-AM13)","v":{"$error":"#VALUE!"}},null,"5415141+110x15",{"v":7.34,"d":"7.34 m"},{"v":10.09,"d":"10.09 m"},{"v":6.79,"d":"6.79 m"},{"v":9.430000000000003,"d":"9.43 m"},{"v":6.35,"d":"6.35 m"},{"v":8.939999999999992,"d":"8.94 m"},{"v":5.98,"d":"5.98 m"},{"v":5.825,"d":"5.83 m"},{"v":5.67,"d":"5.67 m"},{"v":8.009999999999998,"d":"8.01 m"},{"v":5.41,"d":"5.41 m"},{"$f":"BA14-(BA14-BC14)*($Y$1-$X$1)/($Z$1-$X$1)","v":{"v":7.710000000000003,"d":"7.71 m"}},{"v":5.18,"d":"5.18 m"},{"$nulls":12},{"$f":"IF(AND($D$7>BP13,$D$7<BP15),$D$7,\"nicht interpolieren\")","v":"nicht interpolieren"},{"$f":"BQ13-(BQ13-BQ15)*(BP14-BP13)/(BP15-BP13)","v":{"$error":"#VALUE!"}},null,"5415141+110x15",{"v":8.37,"d":"8.37 m"},{"v":11.519999999999996,"d":"11.52 m"},{"v":7.74,"d":"7.74 m"},{"v":10.8,"d":"10.80 m"},{"v":7.23,"d":"7.23 m"},{"v":10.099999999999998,"d":"10.10 m"},{"v":6.82,"d":"6.82 m"},{"v":6.640000000000001,"d":"6.64 m"},{"v":6.46,"d":"6.46 m"},{"v":9.16,"d":"9.16 m"},{"v":6.16,"d":"6.16 m"},{"v":8.860000000000003,"d":"8.86 m"},{"v":5.89,"d":"5.89 m"}]
[{"$nulls":3},{"$f":"IF(B14>D14,\"Bedingung nicht erfüllt!\",\"Bedingung erfüllt!\")","v":"Bedingung nicht erfüllt!"},null,null,"1a) Korrigierter lzul1",{"$f":"H14*H2*H3*H4*H5*H6","v":{"v":3.2209600000000003,"d":"3.22 m"}},{"$nulls":4},"5415141+Z-Profil",{"v":5.05,"d":"5.05 m"},{"v":6.450000000000001,"d":"6.45 m"},{"v":4.77,"d":"4.77 m"},{"v":6.089999999999998,"d":"6.09 m"},{"v":4.55,"d":"4.55 m"},{"v":5.8799999999999955,"d":"5.88 m"},{"v":4.36,"d":"4.36 m"},{"v":4.28,"d":"4.28 m"},{"v":4.2,"d":"4.20 m"},{"v":5.460000000000006,"d":"5.46 m"},{"v":4.06,"d":"4.06 m"},{"v":5.259999999999995,"d":"5.26 m"},{"v":3.94,"d":"3.94 m"},{"$nulls":12},{"v":2.5,"d":"2.50 kN/qm"},0.71,null,"5415141+Z-Profil",{"v":6.14,"d":"6.14 m"},{"v":8.64,"d":"8.64 m"},{"v":5.64,"d":"5.64 m"},{"v":7.979999999999999,"d":"7.98 m"},{"v":5.25,"d":"5.25 m"},{"v":7.49,"d":"7.49 m"},{"v":4.93,"d":"4.93 m"},{"v":4.795,"d":"4.80 m"},{"v":4.66,"d":"4.66 m"},{"v":6.730000000000004,"d":"6.73 m"},{"v":4.43,"d":"4.43 m"},{"$f":"BA15-(BA15-BC15)*($Y$1-$X$1)/($Z$1-$X$1)","v":{"v":6.429999999999991,"d":"6.43 m"}},{"v":4.23,"d":"4.23 m"},{"$nulls":12},{"v":4,"d":"4.00 kN/qm"},0.64,null,"5415141+Z-Profil",{"v":6.99,"d":"6.99 m"},{"v":9.840000000000002,"d":"9.84 m"},{"v":6.42,"d":"6.42 m"},{"v":9.120000000000001,"d":"9.12 m"},{"v":5.97,"d":"5.97 m"},{"v":8.559999999999999,"d":"8.56 m"},{"v":5.6,"d":"5.60 m"},{"v":5.45,"d":"5.45 m"},{"v":5.3,"d":"5.30 m"},{"v":7.729999999999997,"d":"7.73 m"},{"v":5.03,"d":"5.03 m"},{"v":7.230000000000005,"d":"7.23 m"},{"v":4.81,"d":"4.81 m"}]
[null,"Durchbiegung w","=",{"$f":"((1000/VLOOKUP('Bemessungstabelle unisoliert'!D13,Daten!A22:B25,2))*D10^4/H15^3)/COS($D$9*PI()/180)","v":{"v":22.799993766846093,"d":"23 mm"}},{"$nulls":5},"1a) Dachneigung","1a) k",null,"5415142",{"v":5.05,"d":"5.05 m"},{"v":6.450000000000001,"d":"6.45 m"},{"v":4.77,"d":"4.77 m"},{"v":6.2099999999999955,"d":"6.21 m"},{"v":4.53,"d":"4.53 m"},{"v":5.860000000000001,"d":"5.86 m"},{"v":4.34,"d":"4.34 m"},{"v":4.26,"d":"4.26 m"},{"v":4.18,"d":"4.18 m"},{"v":5.439999999999998,"d":"5.44 m"},{"v":4.04,"d":"4.04 m"},{"v":5.24,"d":"5.24 m"},{"v":3.92,"d":"3.92 m"},{"$nulls":12},{"$f":"IF(AND($D$6>AM15,$D$6<AM17),$D$6,\"nicht interpolieren\")","v":"nicht interpolieren"},{"$f":"AN15-(AN15-AN17)*(AM16-AM15)/(AM17-AM15)","v":{"$error":"#VALUE!"}},null,"5415142",{"v":6.5,"d":"6.50 m"},{"v":9.25,"d":"9.25 m"},{"v":5.95,"d":"5.95 m"},{"v":8.530000000000005,"d":"8.53 m"},{"v":5.52,"d":"5.52 m"},{"v":7.899999999999997,"d":"7.90 m"},{"v":5.18,"d":"5.18 m"},{"v":5.035,"d":"5.04 m"},{"v":4.89,"d":"4.89 m"},{"v":7.140000000000001,"d":"7.14 m"},{"v":4.64,"d":"4.64 m"},{"$f":"BA16-(BA16-BC16)*($Y$1-$X$1)/($Z$1-$X$1)","v":{"v":6.7399999999999975,"d":"6.74 m"}},{"v":4.43,"d":"4.43 m"},{"$nulls":15},"5415142",{"v":7.39,"d":"7.39 m"},{"v":10.490000000000002,"d":"10.49 m"},{"v":6.77,"d":"6.77 m"},{"v":9.709999999999996,"d":"9.71 m"},{"v":6.28,"d":"6.28 m"},{"v":9.010000000000002,"d":"9.01 m"},{"v":5.89,"d":"5.89 m"},{"v":5.725,"d":"5.73 m"},{"v":5.56,"d":"5.56 m"},{"v":8.079999999999995,"d":"8.08 m"},{"v":5.28,"d":"5.28 m"},{"v":7.68,"d":"7.68 m"},{"v":5.04,"d":"5.04 m"}]
[{"$nulls":9},{"v":1,"d":"1.00 °"},{"v":1,"d":"1.00"},null,"5415142+140x15",{"v":7.29,"d":"7.29 m"},{"v":9.04,"d":"9.04 m"},{"v":6.94,"d":"6.94 m"},{"v":8.680000000000001,"d":"8.68 m"},{"v":6.65,"d":"6.65 m"},{"v":8.399999999999999,"d":"8.40 m"},{"v":6.4,"d":"6.40 m"},{"v":6.295000000000001,"d":"6.30 m"},{"v":6.19,"d":"6.19 m"},{"v":7.900000000000004,"d":"7.90 m"},{"v":6,"d":"6.00 m"},{"v":7.6,"d":"7.60 m"},{"v":5.84,"d":"5.84 m"},{"$nulls":12},{"v":3,"d":"3.00 kN/qm"},0.66,null,"5415142+140x15",{"v":9.5,"d":"9.50 m"},{"v":12.899999999999999,"d":"12.90 m"},{"v":8.82,"d":"8.82 m"},{"v":12.180000000000003,"d":"12.18 m"},{"v":8.26,"d":"8.26 m"},{"v":11.479999999999997,"d":"11.48 m"},{"v":7.8,"d":"7.80 m"},{"v":7.605,"d":"7.61 m"},{"v":7.41,"d":"7.41 m"},{"v":10.469999999999999,"d":"10.47 m"},{"v":7.07,"d":"7.07 m"},{"$f":"BA17-(BA17-BC17)*($Y$1-$X$1)/($Z$1-$X$1)","v":{"v":9.969999999999999,"d":"9.97 m"}},{"v":6.78,"d":"6.78 m"},{"$nulls":12},"1c) Dachneigung","1c) k",null,"5415142+140x15",{"v":10.84,"d":"10.84 m"},{"v":14.739999999999998,"d":"14.74 m"},{"v":10.06,"d":"10.06 m"},{"v":13.900000000000006,"d":"13.90 m"},{"v":9.42,"d":"9.42 m"},{"v":13.129999999999992,"d":"13.13 m"},{"v":8.89,"d":"8.89 m"},{"v":8.665000000000001,"d":"8.67 m"},{"v":8.44,"d":"8.44 m"},{"v":11.859999999999992,"d":"11.86 m"},{"v":8.06,"d":"8.06 m"},{"v":11.460000000000004,"d":"11.46 m"},{"v":7.72,"d":"7.72 m"}]
[null,"Bemssungstabelle: Pos. 2.1 Seitenträger unisoliert",{"$nulls":7},{"v":10,"d":"10.00 °"},{"v":1,"d":"1.00"},null,"5415142+70x30x3",{"v":5.33,"d":"5.33 m"},{"v":6.78,"d":"6.78 m"},{"v":5.04,"d":"5.04 m"},{"v":6.480000000000001,"d":"6.48 m"},{"v":4.8,"d":"4.80 m"},{"v":6.1299999999999955,"d":"6.13 m"},{"v":4.61,"d":"4.61 m"},{"v":4.525,"d":"4.53 m"},{"v":4.44,"d":"4.44 m"},{"v":5.700000000000006,"d":"5.70 m"},{"v":4.3,"d":"4.30 m"},{"v":5.599999999999998,"d":"5.60 m"},{"v":4.17,"d":"4.17 m"},{"$nulls":15},"5415142+70x30x3",{"v":7.05,"d":"7.05 m"},{"v":9.899999999999997,"d":"9.90 m"},{"v":6.48,"d":"6.48 m"},{"v":9.180000000000001,"d":"9.18 m"},{"v":6.03,"d":"6.03 m"},{"v":8.62,"d":"8.62 m"},{"v":5.66,"d":"5.66 m"},{"v":5.510000000000001,"d":"5.51 m"},{"v":5.36,"d":"5.36 m"},{"v":7.7900000000000045,"d":"7.79 m"},{"v":5.09,"d":"5.09 m"},{"$f":"BA18-(BA18-BC18)*($Y$1-$X$1)/($Z$1-$X$1)","v":{"v":7.289999999999996,"d":"7.29 m"}},{"v":4.87,"d":"4.87 m"},{"$nulls":12},{"v":1,"d":"1.00 °"},{"v":1,"d":"1.00"},null,"5415142+70x30x3",{"v":8.03,"d":"8.03 m"},{"v":11.279999999999998,"d":"11.28 m"},{"v":7.38,"d":"7.38 m"},{"v":10.499999999999998,"d":"10.50 m"},{"v":6.86,"d":"6.86 m"},{"v":9.799999999999997,"d":"9.80 m"},{"v":6.44,"d":"6.44 m"},{"v":6.265000000000001,"d":"6.27 m"},{"v":6.09,"d":"6.09 m"},{"v":8.700000000000001,"d":"8.70 m"},{"v":5.8,"d":"5.80 m"},{"v":8.399999999999995,"d":"8.40 m"},{"v":5.54,"d":"5.54 m"}]
[null,"Seitenträger","=","5415151",{"$nulls":5},{"$f":"IF(AND($D$9>J18,$D$9<J20),$D$9,\"nicht interpolieren\")","v":"nicht interpolieren"},{"$f":"K18-(K18-K20)*(J19-J18)/(J20-J18)","v":{"$error":"#VALUE!"}},null,"5415142+Z-Profil",{"v":5.91,"d":"5.91 m"},{"v":7.510000000000002,"d":"7.51 m"},{"v":5.59,"d":"5.59 m"},{"v":7.149999999999999,"d":"7.15 m"},{"v":5.33,"d":"5.33 m"},{"v":6.8699999999999966,"d":"6.87 m"},{"v":5.11,"d":"5.11 m"},{"v":5.015000000000001,"d":"5.02 m"},{"v":4.92,"d":"4.92 m"},{"v":6.360000000000001,"d":"6.36 m"},{"v":4.76,"d":"4.76 m"},{"v":6.159999999999995,"d":"6.16 m"},{"v":4.62,"d":"4.62 m"},{"$nulls":12},"1b) Dachneigung","1b) k",null,"5415142+Z-Profil",{"v":7.79,"d":"7.79 m"},{"$f":"AQ19-(AQ19-AS19)*($O$1-$N$1)/($P$1-$N$1)","v":{"v":10.940000000000001,"d":"10.94 m"}},{"v":7.16,"d":"7.16 m"},{"v":10.16,"d":"10.16 m"},{"v":6.66,"d":"6.66 m"},{"v":9.529999999999998,"d":"9.53 m"},{"v":6.25,"d":"6.25 m"},{"v":6.08,"d":"6.08 m"},{"v":5.91,"d":"5.91 m"},{"v":8.520000000000001,"d":"8.52 m"},{"v":5.62,"d":"5.62 m"},{"v":8.119999999999997,"d":"8.12 m"},{"v":5.37,"d":"5.37 m"},{"$nulls":12},{"v":10,"d":"10.00 °"},{"v":1,"d":"1.00"},null,"5415142+Z-Profil",{"v":8.86,"d":"8.86 m"},{"v":12.409999999999997,"d":"12.41 m"},{"v":8.15,"d":"8.15 m"},{"v":11.570000000000002,"d":"11.57 m"},{"v":7.58,"d":"7.58 m"},{"v":10.799999999999997,"d":"10.80 m"},{"v":7.12,"d":"7.12 m"},{"v":6.925000000000001,"d":"6.93 m"},{"v":6.73,"d":"6.73 m"},{"v":9.700000000000003,"d":"9.70 m"},{"v":6.4,"d":"6.40 m"},{"$f":"CD19-(CD19-CF19)*($Y$1-$X$1)/($Z$1-$X$1)","v":{"v":9.299999999999997,"d":"9.30 m"}},{"v":6.11,"d":"6.11 m"}]
[null,{"$f":"D10","v":{"v":3.5,"d":"3.50 m"}},{"$f":"IF(B20<D20,\"<\",\">\")","v":">"},{"$f":"MIN(H47,AK53,BN53)","v":{"v":3.4697988,"d":"3.47 m"}},{"$nulls":5},{"v":20,"d":"20.00 °"},{"v":0.97,"d":"0.970"},null,"543001",{"v":1.68,"d":"1.68 m"},{"$f":"N20-(N20-P20)*($O$1-$N$1)/($P$1-$N$1)","v":{"v":2.1299999999999994,"d":"2.13 m"}},{"v":1.59,"d":"1.59 m"},{"v":2.0700000000000007,"d":"2.07 m"},{"v":1.51,"d":"1.51 m"},{"v":2,"d":"2.00 m"},{"v":1.44,"d":"1.44 m"},{"v":1.415,"d":"1.42 m"},{"v":1.39,"d":"1.39 m"},{"v":1.8399999999999985,"d":"1.84 m"},{"v":1.34,"d":"1.34 m"},{"v":1.7400000000000002,"d":"1.74 m"},{"v":1.3,"d":"1.30 m"},{"$nulls":12},{"v":1,"d":"1.00 °"},{"v":1,"d":"1.00"},null,"543001",{"v":2.04,"d":"2.04 m"},{"v":2.8899999999999997,"d":"2.89 m"},{"v":1.87,"d":"1.87 m"},{"v":2.710000000000001,"d":"2.71 m"},{"v":1.73,"d":"1.73 m"},{"v":2.4999999999999982,"d":"2.50 m"},{"v":1.62,"d":"1.62 m"},{"v":1.5750000000000002,"d":"1.58 m"},{"v":1.53,"d":"1.53 m"},{"v":2.250000000000001,"d":"2.25 m"},{"v":1.45,"d":"1.45 m"},{"v":2.15,"d":"2.15 m"},{"v":1.38,"d":"1.38 m"},{"$nulls":12},{"$f":"IF(AND($D$9>BP19,$D$9<BP21),$D$9,\"nicht interpolieren\")","v":"nicht interpolieren"},{"$f":"BQ19-(BQ19-BQ21)*(BP20-BP19)/(BP21-BP19)","v":{"$error":"#VALUE!"}},null,"543001",{"v":2.32,"d":"2.32 m"},{"v":3.3199999999999985,"d":"3.32 m"},{"v":2.12,"d":"2.12 m"},{"v":3.0200000000000014,"d":"3.02 m"},{"v":1.97,"d":"1.97 m"},{"v":2.879999999999998,"d":"2.88 m"},{"v":1.84,"d":"1.84 m"},{"v":1.79,"d":"1.79 m"},{"v":1.74,"d":"1.74 m"},{"v":2.5500000000000007,"d":"2.55 m"},{"v":1.65,"d":"1.65 m"},{"v":2.4499999999999975,"d":"2.45 m"},{"v":1.57,"d":"1.57 m"}]
[{"$nulls":3},{"$f":"IF(B20>D20,\"Bedingung nicht erfüllt!\",\"Bedingung erfüllt!\")","v":"Bedingung nicht erfüllt!"},{"$nulls":5},{"$f":"IF(AND($D$9>J20,$D$9<J22),$D$9,\"nicht interpolieren\")","v":"nicht interpolieren"},{"$f":"K20-(K20-K22)*(J21-J20)/(J22-J20)","v":{"$error":"#VALUE!"}},null,"543002",{"v":5.19,"d":"5.19 m"},{"v":6.640000000000001,"d":"6.64 m"},{"v":4.9,"d":"4.90 m"},{"v":6.280000000000003,"d":"6.28 m"},{"v":4.67,"d":"4.67 m"},{"v":6.07,"d":"6.07 m"},{"v":4.47,"d":"4.47 m"},{"v":4.39,"d":"4.39 m"},{"v":4.31,"d":"4.31 m"},{"v":5.659999999999995,"d":"5.66 m"},{"v":4.16,"d":"4.16 m"},{"v":5.36,"d":"5.36 m"},{"v":4.04,"d":"4.04 m"},{"$nulls":9},"1b) Tabellenwert l",{"$f":"AR28","v":{"v":4.04,"d":"4.04 m"}},null,{"v":10,"d":"10.00 °"},{"v":1,"d":"1.00"},null,"543002",{"v":7.38,"d":"7.38 m"},{"v":10.430000000000003,"d":"10.43 m"},{"v":6.77,"d":"6.77 m"},{"v":9.649999999999997,"d":"9.65 m"},{"v":6.29,"d":"6.29 m"},{"v":9.019999999999996,"d":"9.02 m"},{"v":5.9,"d":"5.90 m"},{"v":5.735,"d":"5.74 m"},{"v":5.57,"d":"5.57 m"},{"v":8.000000000000005,"d":"8.00 m"},{"v":5.3,"d":"5.30 m"},{"v":7.699999999999999,"d":"7.70 m"},{"v":5.06,"d":"5.06 m"},{"$nulls":9},"1c) Tabellenwert l",{"$f":"BU28","v":{"v":4.595000000000001,"d":"4.60 m"}},null,{"v":20,"d":"20.00 °"},{"v":0.99,"d":"0.990"},null,"543002",{"v":8.39,"d":"8.39 m"},{"v":11.840000000000003,"d":"11.84 m"},{"v":7.7,"d":"7.70 m"},{"v":11,"d":"11.00 m"},{"v":7.15,"d":"7.15 m"},{"v":10.23,"d":"10.23 m"},{"v":6.71,"d":"6.71 m"},{"v":6.525,"d":"6.53 m"},{"v":6.34,"d":"6.34 m"},{"v":9.220000000000002,"d":"9.22 m"},{"v":6.02,"d":"6.02 m"},{"v":8.719999999999994,"d":"8.72 m"},{"v":5.75,"d":"5.75 m"}]
[null,"Durchbiegung w","=",{"$f":"((1000/VLOOKUP('Bemessungstabelle unisoliert'!D13,Daten!A22:B25,2))*D10^4/H47^3)/COS($D$9*PI()/180)","v":{"v":18.238026621367244,"d":"18 mm"}},{"$nulls":5},{"v":30,"d":"30.00 °"},0.93,null,"543002+70x30x3",{"v":5.44,"d":"5.44 m"},{"$f":"N22-(N22-P22)*($O$1-$N$1)/($P$1-$N$1)","v":{"v":6.890000000000001,"d":"6.89 m"}},{"v":5.15,"d":"5.15 m"},{"v":6.590000000000002,"d":"6.59 m"},{"v":4.91,"d":"4.91 m"},{"v":6.240000000000002,"d":"6.24 m"},{"v":4.72,"d":"4.72 m"},{"v":4.635,"d":"4.64 m"},{"v":4.55,"d":"4.55 m"},{"v":5.899999999999995,"d":"5.90 m"},{"v":4.4,"d":"4.40 m"},{"v":5.700000000000007,"d":"5.70 m"},{"v":4.27,"d":"4.27 m"},{"$nulls":9},"1b) Korrigierter lzul2",{"$f":"AK21*AK2*AK3*AK4*AK5*AK6","v":{"v":3.93496,"d":"3.93 m"}},null,{"$f":"IF(AND($D$9>AM21,$D$9<AM23),$D$9,\"nicht interpolieren\")","v":"nicht interpolieren"},{"$f":"AN21-(AN21-AN23)*(AM22-AM21)/(AM23-AM21)","v":{"$error":"#VALUE!"}},null,"543002+70x30x3",{"v":7.93,"d":"7.93 m"},{"$f":"AQ22-(AQ22-AS22)*($O$1-$N$1)/($P$1-$N$1)","v":{"v":11.08,"d":"11.08 m"}},{"v":7.3,"d":"7.30 m"},{"v":10.3,"d":"10.30 m"},{"v":6.8,"d":"6.80 m"},{"v":9.669999999999998,"d":"9.67 m"},{"v":6.39,"d":"6.39 m"},{"v":6.22,"d":"6.22 m"},{"v":6.05,"d":"6.05 m"},{"v":8.66,"d":"8.66 m"},{"v":5.76,"d":"5.76 m"},{"$f":"BA22-(BA22-BC22)*($Y$1-$X$1)/($Z$1-$X$1)","v":{"v":8.359999999999996,"d":"8.36 m"}},{"v":5.5,"d":"5.50 m"},{"$nulls":9},"1c) Korrigierter lzul3",{"$f":"BN21*BN2*BN3*BN4*BN5*BN6","v":{"v":45950.00000000001,"d":"45,950.00 m"}},null,{"$f":"IF(AND($D$9>BP21,$D$9<BP23),$D$9,\"nicht interpolieren\")","v":"nicht interpolieren"},{"$f":"BQ21-(BQ21-BQ23)*(BP22-BP21)/(BP23-BP21)","v":{"$error":"#VALUE!"}},null,"543002+70x30x3",{"v":9.03,"d":"9.03 m"},{"v":12.629999999999995,"d":"12.63 m"},{"v":8.31,"d":"8.31 m"},{"v":11.730000000000002,"d":"11.73 m"},{"v":7.74,"d":"7.74 m"},{"v":10.959999999999997,"d":"10.96 m"},{"v":7.28,"d":"7.28 m"},{"v":7.085,"d":"7.09 m"},{"v":6.89,"d":"6.89 m"},{"v":9.95,"d":"9.95 m"},{"v":6.55,"d":"6.55 m"},{"$f":"CD22-(CD22-CF22)*($Y$1-$X$1)/($Z$1-$X$1)","v":{"v":9.449999999999998,"d":"9.45 m"}},{"v":6.26,"d":"6.26 m"}]
[{"$nulls":12},"543004",{"v":4.33,"d":"4.33 m"},{"v":5.530000000000001,"d":"5.53 m"},{"v":4.09,"d":"4.09 m"},{"v":5.289999999999998,"d":"5.29 m"},{"v":3.89,"d":"3.89 m"},{"v":5.01,"d":"5.01 m"},{"v":3.73,"d":"3.73 m"},{"v":3.66,"d":"3.66 m"},{"v":3.59,"d":"3.59 m"},{"v":4.669999999999997,"d":"4.67 m"},{"v":3.47,"d":"3.47 m"},{"v":4.470000000000001,"d":"4.47 m"},{"v":3.37,"d":"3.37 m"},{"$nulls":12},{"v":20,"d":"20.00 °"},{"v":0.98,"d":"0.980"},null,"543004",{"v":6.29,"d":"6.29 m"},{"$f":"AQ23-(AQ23-AS23)*($O$1-$N$1)/($P$1-$N$1)","v":{"v":8.890000000000002,"d":"8.89 m"}},{"v":5.77,"d":"5.77 m"},{"v":8.229999999999995,"d":"8.23 m"},{"v":5.36,"d":"5.36 m"},{"v":7.669999999999998,"d":"7.67 m"},{"v":5.03,"d":"5.03 m"},{"v":4.890000000000001,"d":"4.89 m"},{"v":4.75,"d":"4.75 m"},{"v":6.910000000000002,"d":"6.91 m"},{"v":4.51,"d":"4.51 m"},{"v":6.51,"d":"6.51 m"},{"v":4.31,"d":"4.31 m"},{"$nulls":12},{"v":30,"d":"30.00 °"},0.98,null,"543004",{"v":7.16,"d":"7.16 m"},{"v":10.160000000000004,"d":"10.16 m"},{"v":6.56,"d":"6.56 m"},{"v":9.379999999999999,"d":"9.38 m"},{"v":6.09,"d":"6.09 m"},{"v":8.609999999999994,"d":"8.61 m"},{"v":5.73,"d":"5.73 m"},{"v":5.565,"d":"5.57 m"},{"v":5.4,"d":"5.40 m"},{"v":7.830000000000005,"d":"7.83 m"},{"v":5.13,"d":"5.13 m"},{"v":7.429999999999993,"d":"7.43 m"},{"v":4.9,"d":"4.90 m"}]
[null,"Bemessungstabelle: Pos. 3.1 Rinne unisoliert",{"$nulls":10},"543004+70x30x3",{"v":4.73,"d":"4.73 m"},{"v":6.030000000000004,"d":"6.03 m"},{"v":4.47,"d":"4.47 m"},{"v":5.670000000000001,"d":"5.67 m"},{"v":4.27,"d":"4.27 m"},{"v":5.459999999999998,"d":"5.46 m"},{"v":4.1,"d":"4.10 m"},{"v":4.025,"d":"4.03 m"},{"v":3.95,"d":"3.95 m"},{"v":5.120000000000004,"d":"5.12 m"},{"v":3.82,"d":"3.82 m"},{"v":4.919999999999998,"d":"4.92 m"},{"v":3.71,"d":"3.71 m"},{"$nulls":12},{"$f":"IF(AND($D$9>AM23,$D$9<AM25),$D$9,\"nicht interpolieren\")","v":"nicht interpolieren"},{"$f":"AN23-(AN23-AN25)*(AM24-AM23)/(AM25-AM23)","v":{"$error":"#VALUE!"}},null,"543004+70x30x3",{"v":6.99,"d":"6.99 m"},{"v":9.790000000000003,"d":"9.79 m"},{"v":6.43,"d":"6.43 m"},{"v":9.069999999999997,"d":"9.07 m"},{"v":5.99,"d":"5.99 m"},{"v":8.51,"d":"8.51 m"},{"v":5.63,"d":"5.63 m"},{"v":5.48,"d":"5.48 m"},{"v":5.33,"d":"5.33 m"},{"v":7.669999999999998,"d":"7.67 m"},{"v":5.07,"d":"5.07 m"},{"v":7.270000000000005,"d":"7.27 m"},{"v":4.85,"d":"4.85 m"},{"$nulls":15},"543004+70x30x3",{"v":7.96,"d":"7.96 m"},{"v":11.11,"d":"11.11 m"},{"v":7.33,"d":"7.33 m"},{"v":10.39,"d":"10.39 m"},{"v":6.82,"d":"6.82 m"},{"v":9.689999999999998,"d":"9.69 m"},{"v":6.41,"d":"6.41 m"},{"v":6.235,"d":"6.24 m"},{"v":6.06,"d":"6.06 m"},{"v":8.670000000000002,"d":"8.67 m"},{"v":5.77,"d":"5.77 m"},{"v":8.369999999999996,"d":"8.37 m"},{"v":5.51,"d":"5.51 m"}]
[null,"gewählte  Stützweite b","=",{"v":4,"d":"4.00  m"},{"$nulls":8},"543005",{"v":4.78,"d":"4.78 m"},{"v":6.130000000000003,"d":"6.13 m"},{"v":4.51,"d":"4.51 m"},{"v":5.829999999999998,"d":"5.83 m"},{"v":4.29,"d":"4.29 m"},{"v":5.549999999999997,"d":"5.55 m"},{"v":4.11,"d":"4.11 m"},{"v":4.035,"d":"4.04 m"},{"v":3.96,"d":"3.96 m"},{"v":5.2200000000000015,"d":"5.22 m"},{"v":3.82,"d":"3.82 m"},{"v":4.919999999999998,"d":"4.92 m"},{"v":3.71,"d":"3.71 m"},{"$nulls":12},{"v":30,"d":"30.00 °"},0.96,null,"543005",{"v":6.1,"d":"6.10 m"},{"$f":"AQ25-(AQ25-AS25)*($O$1-$N$1)/($P$1-$N$1)","v":{"v":8.699999999999998,"d":"8.70 m"}},{"v":5.58,"d":"5.58 m"},{"v":7.980000000000002,"d":"7.98 m"},{"v":5.18,"d":"5.18 m"},{"v":7.419999999999993,"d":"7.42 m"},{"v":4.86,"d":"4.86 m"},{"v":4.720000000000001,"d":"4.72 m"},{"v":4.58,"d":"4.58 m"},{"v":6.650000000000004,"d":"6.65 m"},{"v":4.35,"d":"4.35 m"},{"$f":"BA25-(BA25-BC25)*($Y$1-$X$1)/($Z$1-$X$1)","v":{"v":6.249999999999993,"d":"6.25 m"}},{"v":4.16,"d":"4.16 m"},{"$nulls":15},"543005",{"v":6.93,"d":"6.93 m"},{"v":9.83,"d":"9.83 m"},{"v":6.35,"d":"6.35 m"},{"v":9.11,"d":"9.11 m"},{"v":5.89,"d":"5.89 m"},{"v":8.479999999999999,"d":"8.48 m"},{"v":5.52,"d":"5.52 m"},{"v":5.365,"d":"5.37 m"},{"v":5.21,"d":"5.21 m"},{"v":7.549999999999999,"d":"7.55 m"},{"v":4.95,"d":"4.95 m"},{"$f":"CD25-(CD25-CF25)*($Y$1-$X$1)/($Z$1-$X$1)","v":{"v":7.250000000000002,"d":"7.25 m"}},{"v":4.72,"d":"4.72 m"}]
[null,"Rinne","=","541516"]
[null,"zul. Durchbiegung","=","l/250","Info",{"$nulls":7},"Träger","Sparren-Achsabstand","l",{"$nulls":26},"Träger","Sparren-Achsabstand","l",{"$nulls":26},"Träger","Sparren-Achsabstand","l"]
[null,{"$f":"D25","v":{"v":4,"d":"4.00 m"}},{"$f":"IF(B28<D28,\"<\",\">\")","v":"<"},{"$f":"MIN(H61,AK66,BN66)","v":{"v":6.367914600000001,"d":"6.37 m"}},null,null,"2a) Korrekturfaktoren Seitenträger",{"$nulls":5},{"$f":"IF($D$11=\"\",\"\",MATCH($D$11,M2:M25))","v":9},{"$f":"IF($D$12=\"\",\"\",MATCH($D$12,N1:Z1,0))","v":8},{"$f":"IF(OR(D11=\"\",D12=\"\"),0,INDEX(N2:Z25,M28,N28))","v":{"v":3.2800000000000002,"d":"3.28 m"}},{"$nulls":26},{"$f":"IF($D$11=\"\",\"\",MATCH($D$11,AP2:AP25))","v":9},{"$f":"IF($D$12=\"\",\"\",MATCH($D$12,AQ1:BC1,0))","v":8},{"$f":"IF(OR(D11=\"\",D12=\"\"),0,INDEX(AQ2:BC25,AP28,AQ28))","v":{"v":4.04,"d":"4.04 m"}},{"$nulls":26},{"$f":"IF($D$11=\"\",\"\",MATCH($D$11,BS2:BS25))","v":9},{"$f":"IF($D$12=\"\",\"\",MATCH($D$12,BT1:CF1,0))","v":8},{"$f":"IF(OR(D11=\"\",D12=\"\"),0,INDEX(BT2:CF25,BS28,BT28))","v":{"v":4.595000000000001,"d":"4.60 m"}}]
[{"$nulls":3},{"$f":"IF(B28>D28,\"Bedingung nicht erfüllt!\",\"Bedingung erfüllt!\")","v":"Bedingung erfüllt!"},null,null,"2a) Verglasung",{"$f":"H2","v":{"v":1,"d":"1.000"}}]
[null,"Durchbiegung w","=",{"$f":"(1000/VLOOKUP('Bemessungstabelle unisoliert'!D27,Daten!A22:B25,2))*D25^4/H61^3","v":{"v":3.869462770910386,"d":"4 mm"}},null,null,"2a) Schnee sDA ",{"$f":"H3","v":0.982}]
[null,"zul. Durchbiegung wzul.","=",{"$f":"D25*1000/VLOOKUP($D$27,Daten!$A$22:$B$25,2)","v":{"v":16,"d":"16 mm"}},null,null,"2a) Wind",{"$f":"H4","v":{"v":1,"d":"1.000"}},{"$nulls":4},"2a) Seitenträger",{"v":0.5,"d":"0.50 m"},{"$f":"IF(AND($D$12>0.5,$D$12<0.6),$D$12,0)","v":{"v":0,"d":"0.00 m"}},{"v":0.6,"d":"0.60 m"},{"$f":"IF(AND($D$12>0.6,$D$12<0.7),$D$12,0)","v":{"v":0,"d":"0.00 m"}},{"v":0.7,"d":"0.70 m"},{"$f":"IF(AND($D$12>0.7,$D$12<0.8),$D$12,0)","v":{"v":0,"d":"0.00 m"}},{"v":0.8,"d":"0.80 m"},{"$f":"IF(AND($D$12>0.8,$D$12<0.9),$D$12,0)","v":{"v":0.85,"d":"0.85 m"}},{"v":0.9,"d":"0.90 m"},{"$f":"IF(AND($D$12>0.9,$D$12<1),$D$12,0)","v":{"v":0,"d":"0.00 m"}},{"v":1,"d":"1.00 m"},{"$f":"IF(AND($D$12>1,$D$12<1.1),$D$12,0)","v":{"v":0,"d":"0.00 m"}},{"v":1.1,"d":"1.10 m"},{"$nulls":9},"Korrekturfaktoren",{"$nulls":5},"2b) Seitenträger",{"v":0.5,"d":"0.50 m"},{"$f":"IF(AND($D$12>0.5,$D$12<0.6),$D$12,0)","v":{"v":0,"d":"0.00 m"}},{"v":0.6,"d":"0.60 m"},{"$f":"IF(AND($D$12>0.6,$D$12<0.7),$D$12,0)","v":{"v":0,"d":"0.00 m"}},{"v":0.7,"d":"0.70 m"},{"$f":"IF(AND($D$12>0.7,$D$12<0.8),$D$12,0)","v":{"v":0,"d":"0.00 m"}},{"v":0.8,"d":"0.80 m"},{"$f":"IF(AND($D$12>0.8,$D$12<0.9),$D$12,0)","v":{"v":0.85,"d":"0.85 m"}},{"v":0.9,"d":"0.90 m"},{"$f":"IF(AND($D$12>0.9,$D$12<1),$D$12,0)","v":{"v":0,"d":"0.00 m"}},{"v":1,"d":"1.00 m"},{"$f":"IF(AND($D$12>1,$D$12<1.1),$D$12,0)","v":{"v":0,"d":"0.00 m"}},{"v":1.1,"d":"1.10 m"},{"$nulls":9},"Korrekturfaktoren",{"$nulls":5},"2c) Seitenträger",{"v":0.5,"d":"0.50 m"},{"$f":"IF(AND($D$12>0.5,$D$12<0.6),$D$12,0)","v":{"v":0,"d":"0.00 m"}},{"v":0.6,"d":"0.60 m"},{"$f":"IF(AND($D$12>0.6,$D$12<0.7),$D$12,0)","v":{"v":0,"d":"0.00 m"}},{"v":0.7,"d":"0.70 m"},{"$f":"IF(AND($D$12>0.7,$D$12<0.8),$D$12,0)","v":{"v":0,"d":"0.00 m"}},{"v":0.8,"d":"0.80 m"},{"$f":"IF(AND($D$12>0.8,$D$12<0.9),$D$12,0)","v":{"v":0.85,"d":"0.85 m"}},{"v":0.9,"d":"0.90 m"},{"$f":"IF(AND($D$12>0.9,$D$12<1),$D$12,0)","v":{"v":0,"d":"0.00 m"}},{"v":1,"d":"1.00 m"},{"$f":"IF(AND($D$12>1,$D$12<1.1),$D$12,0)","v":{"v":0,"d":"0.00 m"}},{"v":1.1,"d":"1.10 m"}]
[null,"2-Feldbalken b + b",{"$nulls":4},"2a) Dachneigung",{"$f":"H5","v":{"v":1,"d":"1.000"}},{"$nulls":4},"26106",{"$f":"N2*1.18","v":{"v":4.071,"d":"4.07 m"}},{"$f":"N32-(N32-P32)*($O$31-$N$31)/($P$31-$N$31)","v":{"v":5.250999999999999,"d":"5.25 m"}},{"$f":"P2*1.18","v":{"v":3.835,"d":"3.84 m"}},{"$f":"P32-(P32-R32)*($Q$31-$P$31)/($R$31-$P$31)","v":{"v":4.897,"d":"4.90 m"}},{"$f":"R2*1.18","v":{"v":3.658,"d":"3.66 m"}},{"$f":"R32-(R32-T32)*($S$31-$R$31)/($T$31-$R$31)","v":{"v":4.814399999999999,"d":"4.81 m"}},{"$f":"T2*1.18","v":{"v":3.4928,"d":"3.49 m"}},{"$f":"T32-(T32-V32)*($U$31-$T$31)/($V$31-$T$31)","v":{"v":3.4279,"d":"3.43 m"}},{"$f":"V2*1.18","v":{"v":3.363,"d":"3.36 m"}},{"$f":"V32-(V32-X32)*($W$31-$V$31)/($X$31-$V$31)","v":{"v":4.425000000000003,"d":"4.43 m"}},{"$f":"X2*1.18","v":{"v":3.2449999999999997,"d":"3.25 m"}},{"$f":"X32-(X32-Z32)*($Y$31-$X$31)/($Z$31-$X$31)","v":{"v":4.1889999999999965,"d":"4.19 m"}},{"$f":"Z2*1.18","v":{"v":3.1506,"d":"3.15 m"}},{"$nulls":9},"2b) Verglasung",{"$f":"AK2","v":{"v":1,"d":"1.000"}},{"$nulls":4},"26106",{"$f":"AQ2*1.18","v":{"v":4.601999999999999,"d":"4.60 m"}},{"$f":"AQ32-(AQ32-AS32)*($O$31-$N$31)/($P$31-$N$31)","v":{"v":6.489999999999997,"d":"6.49 m"}},{"$f":"AS2*1.18","v":{"v":4.2244,"d":"4.22 m"}},{"$f":"AS32-(AS32-AU32)*($Q$31-$P$31)/($R$31-$P$31)","v":{"v":6.065200000000003,"d":"6.07 m"}},{"$f":"AU2*1.18","v":{"v":3.9175999999999997,"d":"3.92 m"}},{"$f":"AU32-(AU32-AW32)*($S$31-$R$31)/($T$31-$R$31)","v":{"v":5.6522,"d":"5.65 m"}},{"$f":"AW2*1.18","v":{"v":3.6697999999999995,"d":"3.67 m"}},{"$f":"AW32-(AW32-AY32)*($U$31-$T$31)/($V$31-$T$31)","v":{"v":3.5635999999999997,"d":"3.56 m"}},{"$f":"AY2*1.18","v":{"v":3.4574,"d":"3.46 m"}},{"$f":"AY32-(AY32-BA32)*($W$31-$V$31)/($X$31-$V$31)","v":{"v":5.050400000000001,"d":"5.05 m"}},{"$f":"BA2*1.18","v":{"v":3.2803999999999998,"d":"3.28 m"}},{"$f":"BA32-(BA32-BC32)*($Y$31-$X$31)/($Z$31-$X$31)","v":{"v":4.814399999999998,"d":"4.81 m"}},{"$f":"BC2*1.18","v":{"v":3.127,"d":"3.13 m"}},{"$nulls":9},"2c) Verglasung",{"$f":"BN2","v":{"v":1,"d":"1.000"}},{"$nulls":4},"26106",{"$f":"BT2*1.18","v":{"v":5.2392,"d":"5.24 m"}},{"$f":"BT32-(BT32-BV32)*($O$31-$N$31)/($P$31-$N$31)","v":{"v":7.422200000000002,"d":"7.42 m"}},{"$f":"BV2*1.18","v":{"v":4.8026,"d":"4.80 m"}},{"$f":"BV32-(BV32-BX32)*($Q$31-$P$31)/($R$31-$P$31)","v":{"v":6.9266000000000005,"d":"6.93 m"}},{"$f":"BX2*1.18","v":{"v":4.4486,"d":"4.45 m"}},{"$f":"BX32-(BX32-BZ32)*($S$31-$R$31)/($T$31-$R$31)","v":{"v":6.430999999999997,"d":"6.43 m"}},{"$f":"BZ2*1.18","v":{"v":4.1654,"d":"4.17 m"}},{"$f":"BZ32-(BZ32-CB32)*($U$31-$T$31)/($V$31-$T$31)","v":{"v":4.0474,"d":"4.05 m"}},{"$f":"CB2*1.18","v":{"v":3.9294,"d":"3.93 m"}},{"$f":"CB32-(CB32-CD32)*($W$31-$V$31)/($X$31-$V$31)","v":{"v":5.734799999999997,"d":"5.73 m"}},{"$f":"CD2*1.18","v":{"v":3.7288,"d":"3.73 m"}},{"$f":"CD32-(CD32-CF32)*($Y$31-$X$31)/($Z$31-$X$31)","v":{"v":5.380800000000003,"d":"5.38 m"}},{"$f":"CF2*1.18","v":{"v":3.5635999999999997,"d":"3.56 m"}}]
[null,"Durchbiegung w","=",{"$f":"(1000/VLOOKUP($D$27,Daten!$A$22:$B$25,2))*$D$25^4/($H$61*H58)^3","v":{"v":1.6081860014822247,"d":"2 mm"}},null,null,"zul. Durchbiegung",{"$f":"H6","v":{"v":1,"d":"1.000"}},{"$nulls":4},"26106+100x10",{"$f":"N3*1.16","v":{"v":5.6144,"d":"5.61 m"}},{"v":7.1224000000000025,"d":"7.12 m"},{"$f":"P3*1.16","v":{"v":5.312799999999999,"d":"5.31 m"}},{"v":6.7048000000000005,"d":"6.70 m"},{"$f":"R3*1.16","v":{"v":5.080799999999999,"d":"5.08 m"}},{"v":6.542399999999992,"d":"6.54 m"},{"$f":"T3*1.16","v":{"v":4.872,"d":"4.87 m"}},{"v":4.785,"d":"4.79 m"},{"$f":"V3*1.16","v":{"v":4.6979999999999995,"d":"4.70 m"}},{"v":6.055200000000003,"d":"6.06 m"},{"$f":"X3*1.16","v":{"v":4.547199999999999,"d":"4.55 m"}},{"v":5.823199999999991,"d":"5.82 m"},{"$f":"Z3*1.16","v":{"v":4.4196,"d":"4.42 m"}},{"$nulls":9},"2b) Schnee sDA ",{"$f":"AK3","v":0.974},{"$nulls":4},"26106+100x10",{"$f":"AQ3*1.16","v":{"v":7.029599999999999,"d":"7.03 m"}},{"v":9.8136,"d":"9.81 m"},{"$f":"AS3*1.16","v":{"v":6.472799999999999,"d":"6.47 m"}},{"v":9.117599999999996,"d":"9.12 m"},{"$f":"AU3*1.16","v":{"v":6.032,"d":"6.03 m"}},{"v":8.549199999999999,"d":"8.55 m"},{"$f":"AW3*1.16","v":{"v":5.6724,"d":"5.67 m"}},{"v":5.521599999999999,"d":"5.52 m"},{"$f":"AY3*1.16","v":{"v":5.370799999999999,"d":"5.37 m"}},{"v":7.667599999999995,"d":"7.67 m"},{"$f":"BA3*1.16","v":{"v":5.1156,"d":"5.12 m"}},{"v":7.435599999999999,"d":"7.44 m"},{"$f":"BC3*1.16","v":{"v":4.8835999999999995,"d":"4.88 m"}},{"$nulls":9},"2c) außergewöhnliche Schneelast sa",{"$f":"BN3","v":{"v":10000,"d":"10000.000"}},{"$nulls":4},"26106+100x10",{"$f":"BT3*1.16","v":{"v":7.9692,"d":"7.97 m"}},{"v":10.9272,"d":"10.93 m"},{"$f":"BV3*1.16","v":{"v":7.3776,"d":"7.38 m"}},{"v":10.440000000000005,"d":"10.44 m"},{"$f":"BX3*1.16","v":{"v":6.8671999999999995,"d":"6.87 m"}},{"v":9.709199999999996,"d":"9.71 m"},{"$f":"BZ3*1.16","v":{"v":6.4612,"d":"6.46 m"}},{"v":6.2871999999999995,"d":"6.29 m"},{"$f":"CB3*1.16","v":{"v":6.113199999999999,"d":"6.11 m"}},{"v":8.827599999999997,"d":"8.83 m"},{"$f":"CD3*1.16","v":{"v":5.811599999999999,"d":"5.81 m"}},{"v":8.363599999999991,"d":"8.36 m"},{"$f":"CF3*1.16","v":{"v":5.5564,"d":"5.56 m"}}]
[{"$nulls":12},"261071",{"$f":"N6*1.19","v":{"v":5.4978,"d":"5.50 m"}},{"v":7.044799999999997,"d":"7.04 m"},{"$f":"P6*1.19","v":{"v":5.188400000000001,"d":"5.19 m"}},{"v":6.687800000000002,"d":"6.69 m"},{"$f":"R6*1.19","v":{"v":4.9385,"d":"4.94 m"}},{"v":6.437899999999999,"d":"6.44 m"},{"$f":"T6*1.19","v":{"v":4.7243,"d":"4.72 m"}},{"v":4.635050000000001,"d":"4.64 m"},{"$f":"V6*1.19","v":{"v":4.5458,"d":"4.55 m"}},{"v":5.9381,"d":"5.94 m"},{"$f":"X6*1.19","v":{"v":4.3911,"d":"4.39 m"}},{"v":5.700099999999995,"d":"5.70 m"},{"$f":"Z6*1.19","v":{"v":4.2602,"d":"4.26 m"}},{"$nulls":9},"2b) Wind",{"$f":"AK4","v":{"v":1,"d":"1.000"}},{"$nulls":4},"261071",{"$f":"AQ6*1.19","v":{"v":6.4498,"d":"6.45 m"}},{"v":9.127300000000004,"d":"9.13 m"},{"$f":"AS6*1.19","v":{"v":5.914299999999999,"d":"5.91 m"}},{"v":8.484699999999993,"d":"8.48 m"},{"$f":"AU6*1.19","v":{"v":5.4859,"d":"5.49 m"}},{"v":7.901599999999995,"d":"7.90 m"},{"$f":"AW6*1.19","v":{"v":5.1408000000000005,"d":"5.14 m"}},{"v":4.998,"d":"5.00 m"},{"$f":"AY6*1.19","v":{"v":4.8552,"d":"4.86 m"}},{"v":7.104300000000002,"d":"7.10 m"},{"$f":"BA6*1.19","v":{"v":4.6053,"d":"4.61 m"}},{"v":6.747299999999997,"d":"6.75 m"},{"$f":"BC6*1.19","v":{"v":4.3911,"d":"4.39 m"}},{"$nulls":9},"2c) Wind",{"$f":"BN4","v":{"v":1,"d":"1.000"}},{"$nulls":4},"261071",{"$f":"BT6*1.19","v":{"v":7.3423,"d":"7.34 m"}},{"v":10.436299999999997,"d":"10.44 m"},{"$f":"BV6*1.19","v":{"v":6.7235000000000005,"d":"6.72 m"}},{"v":9.650900000000005,"d":"9.65 m"},{"$f":"BX6*1.19","v":{"v":6.2356,"d":"6.24 m"}},{"v":8.984499999999993,"d":"8.98 m"},{"$f":"BZ6*1.19","v":{"v":5.8429,"d":"5.84 m"}},{"v":5.6763,"d":"5.68 m"},{"$f":"CB6*1.19","v":{"v":5.5097,"d":"5.51 m"}},{"v":7.972999999999999,"d":"7.97 m"},{"$f":"CD6*1.19","v":{"v":5.236,"d":"5.24 m"}},{"v":7.6159999999999926,"d":"7.62 m"},{"$f":"CF6*1.19","v":{"v":4.998,"d":"5.00 m"}}]
[null,"Bemessungstabelle: Pos. 4.1 Unterzug unisoliert",{"$nulls":10},"261071+100x10",{"$f":"N7*1.21","v":{"v":6.630800000000001,"d":"6.63 m"}},{"v":8.324800000000005,"d":"8.32 m"},{"$f":"P7*1.21","v":{"v":6.292,"d":"6.29 m"}},{"v":8.0344,"d":"8.03 m"},{"$f":"R7*1.21","v":{"v":6.0016,"d":"6.00 m"}},{"v":7.610900000000003,"d":"7.61 m"},{"$f":"T7*1.21","v":{"v":5.771699999999999,"d":"5.77 m"}},{"v":5.66885,"d":"5.67 m"},{"$f":"V7*1.21","v":{"v":5.566,"d":"5.57 m"}},{"v":7.199499999999999,"d":"7.20 m"},{"$f":"X7*1.21","v":{"v":5.3845,"d":"5.38 m"}},{"v":6.957500000000001,"d":"6.96 m"},{"$f":"Z7*1.21","v":{"v":5.2272,"d":"5.23 m"}},{"$nulls":9},"2b) Dachneigung",{"$f":"AK5","v":{"v":1,"d":"1.000"}},{"$nulls":4},"261071+100x10",{"$f":"AQ7*1.21","v":{"v":8.5184,"d":"8.52 m"}},{"v":11.8459,"d":"11.85 m"},{"$f":"AS7*1.21","v":{"v":7.8529,"d":"7.85 m"}},{"v":10.974700000000006,"d":"10.97 m"},{"$f":"AU7*1.21","v":{"v":7.332599999999999,"d":"7.33 m"}},{"v":10.381799999999991,"d":"10.38 m"},{"$f":"AW7*1.21","v":{"v":6.897,"d":"6.90 m"}},{"v":6.70945,"d":"6.71 m"},{"$f":"AY7*1.21","v":{"v":6.5219,"d":"6.52 m"}},{"v":9.353299999999997,"d":"9.35 m"},{"$f":"BA7*1.21","v":{"v":6.2073,"d":"6.21 m"}},{"v":8.869300000000003,"d":"8.87 m"},{"$f":"BC7*1.21","v":{"v":5.9411,"d":"5.94 m"}},{"$nulls":9},"2c) Dachneigung",{"$f":"BN5","v":{"v":1,"d":"1.000"}},{"$nulls":4},"261071+100x10",{"$f":"BT7*1.21","v":{"v":9.704199999999998,"d":"9.70 m"}},{"v":13.455199999999987,"d":"13.46 m"},{"$f":"BV7*1.21","v":{"v":8.954,"d":"8.95 m"}},{"v":12.656600000000005,"d":"12.66 m"},{"$f":"BX7*1.21","v":{"v":8.3369,"d":"8.34 m"}},{"v":11.809599999999993,"d":"11.81 m"},{"$f":"BZ7*1.21","v":{"v":7.840800000000001,"d":"7.84 m"}},{"v":7.6351,"d":"7.64 m"},{"$f":"CB7*1.21","v":{"v":7.429399999999999,"d":"7.43 m"}},{"v":10.696399999999997,"d":"10.70 m"},{"$f":"CD7*1.21","v":{"v":7.0664,"d":"7.07 m"}},{"v":10.0914,"d":"10.09 m"},{"$f":"CF7*1.21","v":{"v":6.7639,"d":"6.76 m"}}]
[null,"Trägerlänge bis Unterzung l","=",{"v":5,"d":"5.00  m"},{"$nulls":8},"261073",{"$f":"N8*0.99","v":{"v":5.2668,"d":"5.27 m"}},{"v":6.751800000000003,"d":"6.75 m"},{"$f":"P8*0.99","v":{"v":4.969799999999999,"d":"4.97 m"}},{"v":6.3953999999999915,"d":"6.40 m"},{"$f":"R8*0.99","v":{"v":4.732200000000001,"d":"4.73 m"}},{"v":6.118200000000002,"d":"6.12 m"},{"$f":"T8*0.99","v":{"v":4.5342,"d":"4.53 m"}},{"v":4.45005,"d":"4.45 m"},{"$f":"V8*0.99","v":{"v":4.3659,"d":"4.37 m"}},{"v":5.702400000000003,"d":"5.70 m"},{"$f":"X8*0.99","v":{"v":4.2174,"d":"4.22 m"}},{"v":5.504399999999992,"d":"5.50 m"},{"$f":"Z8*0.99","v":{"v":4.0887,"d":"4.09 m"}},{"$nulls":9},"zul. Durchbiegung",{"$f":"AK6","v":{"v":1,"d":"1.000"}},{"$nulls":4},"261073",{"$f":"AQ8*0.99","v":{"v":7.2368999999999994,"d":"7.24 m"}},{"v":10.206899999999997,"d":"10.21 m"},{"$f":"AS8*0.99","v":{"v":6.6429,"d":"6.64 m"}},{"v":9.494100000000001,"d":"9.49 m"},{"$f":"AU8*0.99","v":{"v":6.1677,"d":"6.17 m"}},{"v":8.870399999999997,"d":"8.87 m"},{"$f":"AW8*0.99","v":{"v":5.7816,"d":"5.78 m"}},{"v":5.61825,"d":"5.62 m"},{"$f":"AY8*0.99","v":{"v":5.454899999999999,"d":"5.45 m"}},{"v":7.860599999999997,"d":"7.86 m"},{"$f":"BA8*0.99","v":{"v":5.1876,"d":"5.19 m"}},{"v":7.563599999999994,"d":"7.56 m"},{"$f":"BC8*0.99","v":{"v":4.95,"d":"4.95 m"}},{"$nulls":9},"zul. Durchbiegung",{"$f":"BN6","v":{"v":1,"d":"1.000"}},{"$nulls":4},"261073",{"$f":"BT8*0.99","v":{"v":8.2368,"d":"8.24 m"}},{"v":11.652300000000004,"d":"11.65 m"},{"$f":"BV8*0.99","v":{"v":7.5537,"d":"7.55 m"}},{"v":10.820700000000002,"d":"10.82 m"},{"$f":"BX8*0.99","v":{"v":7.0092,"d":"7.01 m"}},{"v":10.058399999999997,"d":"10.06 m"},{"$f":"BZ8*0.99","v":{"v":6.5736,"d":"6.57 m"}},{"v":6.3904499999999995,"d":"6.39 m"},{"$f":"CB8*0.99","v":{"v":6.207299999999999,"d":"6.21 m"}},{"v":8.96939999999999,"d":"8.97 m"},{"$f":"CD8*0.99","v":{"v":5.9004,"d":"5.90 m"}},{"v":8.573399999999994,"d":"8.57 m"},{"$f":"CF8*0.99","v":{"v":5.633100000000001,"d":"5.63 m"}}]
[null,"Dachüberstand lü","=",{"v":0,"d":"0.00  m"},{"$nulls":8},"261073+100x10",{"$f":"N9*1.06","v":{"v":6.3176000000000005,"d":"6.32 m"}},{"v":7.9605999999999995,"d":"7.96 m"},{"$f":"P9*1.06","v":{"v":5.989000000000001,"d":"5.99 m"}},{"v":7.578999999999999,"d":"7.58 m"},{"$f":"R9*1.06","v":{"v":5.724000000000001,"d":"5.72 m"}},{"v":7.356400000000006,"d":"7.36 m"},{"$f":"T9*1.06","v":{"v":5.4908,"d":"5.49 m"}},{"v":5.3954,"d":"5.40 m"},{"$f":"V9*1.06","v":{"v":5.300000000000001,"d":"5.30 m"}},{"v":6.8264000000000085,"d":"6.83 m"},{"$f":"X9*1.06","v":{"v":5.1304,"d":"5.13 m"}},{"v":6.6143999999999945,"d":"6.61 m"},{"$f":"Z9*1.06","v":{"v":4.982,"d":"4.98 m"}},{"$nulls":15},"261073+100x10",{"$f":"AQ9*1.06","v":{"v":8.7768,"d":"8.78 m"}},{"v":12.168800000000001,"d":"12.17 m"},{"$f":"AS9*1.06","v":{"v":8.0984,"d":"8.10 m"}},{"v":11.341999999999997,"d":"11.34 m"},{"$f":"AU9*1.06","v":{"v":7.5578,"d":"7.56 m"}},{"v":10.674199999999995,"d":"10.67 m"},{"$f":"AW9*1.06","v":{"v":7.1126000000000005,"d":"7.11 m"}},{"v":6.927100000000001,"d":"6.93 m"},{"$f":"AY9*1.06","v":{"v":6.741600000000001,"d":"6.74 m"}},{"v":9.603600000000014,"d":"9.60 m"},{"$f":"BA9*1.06","v":{"v":6.4235999999999995,"d":"6.42 m"}},{"v":9.285599999999988,"d":"9.29 m"},{"$f":"BC9*1.06","v":{"v":6.1374,"d":"6.14 m"}},{"$nulls":15},"261073+100x10",{"$f":"BT9*1.06","v":{"v":10.0064,"d":"10.01 m"}},{"v":13.875399999999988,"d":"13.88 m"},{"$f":"BV9*1.06","v":{"v":9.232600000000001,"d":"9.23 m"}},{"v":12.985000000000017,"d":"12.99 m"},{"$f":"BX9*1.06","v":{"v":8.607199999999999,"d":"8.61 m"}},{"v":12.168799999999989,"d":"12.17 m"},{"$f":"BZ9*1.06","v":{"v":8.0984,"d":"8.10 m"}},{"v":7.8864,"d":"7.89 m"},{"$f":"CB9*1.06","v":{"v":7.6744,"d":"7.67 m"}},{"v":11.013400000000004,"d":"11.01 m"},{"$f":"CD9*1.06","v":{"v":7.3034,"d":"7.30 m"}},{"v":10.483399999999993,"d":"10.48 m"},{"$f":"CF9*1.06","v":{"v":6.9854,"d":"6.99 m"}}]
[null,"lm","=",{"$f":"IF(D37=0,D36/2+0,(D36+D37)^2/(2*D36))","v":{"v":2.5,"d":"2.50  m"}},{"$nulls":8},"5415150",{"$f":"N10*1.17","v":{"v":4.5512999999999995,"d":"4.55 m"}},{"v":5.838299999999998,"d":"5.84 m"},{"$f":"P10*1.17","v":{"v":4.2939,"d":"4.29 m"}},{"v":5.5574999999999966,"d":"5.56 m"},{"$f":"R10*1.17","v":{"v":4.0833,"d":"4.08 m"}},{"v":5.311800000000005,"d":"5.31 m"},{"$f":"T10*1.17","v":{"v":3.9077999999999995,"d":"3.91 m"}},{"v":3.8375999999999997,"d":"3.84 m"},{"$f":"V10*1.17","v":{"v":3.7674,"d":"3.77 m"}},{"v":4.925700000000003,"d":"4.93 m"},{"$f":"X10*1.17","v":{"v":3.6386999999999996,"d":"3.64 m"}},{"v":4.808699999999998,"d":"4.81 m"},{"$f":"Z10*1.17","v":{"v":3.5216999999999996,"d":"3.52 m"}},{"$nulls":15},"5415150",{"$f":"AQ10*1.17","v":{"v":6.1191,"d":"6.12 m"}},{"v":8.693100000000006,"d":"8.69 m"},{"$f":"AS10*1.17","v":{"v":5.604299999999999,"d":"5.60 m"}},{"v":8.061299999999997,"d":"8.06 m"},{"$f":"AU10*1.17","v":{"v":5.1948,"d":"5.19 m"}},{"v":7.4879999999999995,"d":"7.49 m"},{"$f":"AW10*1.17","v":{"v":4.8671999999999995,"d":"4.87 m"}},{"v":4.7268,"d":"4.73 m"},{"$f":"AY10*1.17","v":{"v":4.586399999999999,"d":"4.59 m"}},{"v":6.587099999999998,"d":"6.59 m"},{"$f":"BA10*1.17","v":{"v":4.3641,"d":"4.36 m"}},{"v":6.353099999999999,"d":"6.35 m"},{"$f":"BC10*1.17","v":{"v":4.1652,"d":"4.17 m"}},{"$nulls":15},"5415150",{"$f":"BT10*1.17","v":{"v":6.9615,"d":"6.96 m"}},{"v":9.945000000000002,"d":"9.95 m"},{"$f":"BV10*1.17","v":{"v":6.3648,"d":"6.36 m"}},{"v":9.102600000000004,"d":"9.10 m"},{"$f":"BX10*1.17","v":{"v":5.908499999999999,"d":"5.91 m"}},{"v":8.529299999999989,"d":"8.53 m"},{"$f":"BZ10*1.17","v":{"v":5.5341000000000005,"d":"5.53 m"}},{"v":5.37615,"d":"5.38 m"},{"$f":"CB10*1.17","v":{"v":5.2181999999999995,"d":"5.22 m"}},{"v":7.534799999999997,"d":"7.53 m"},{"$f":"CD10*1.17","v":{"v":4.9608,"d":"4.96 m"}},{"v":7.300799999999997,"d":"7.30 m"},{"$f":"CF10*1.17","v":{"v":4.7268,"d":"4.73 m"}}]
[null,"gewählte Stützweite b","=",{"v":5.01,"d":"5.01  m"},{"$nulls":8},"5415150+70x30x3",{"$f":"N11*1.18","v":{"v":5.192,"d":"5.19 m"}},{"v":6.608,"d":"6.61 m"},{"$f":"P11*1.18","v":{"v":4.9088,"d":"4.91 m"}},{"v":6.324800000000004,"d":"6.32 m"},{"$f":"R11*1.18","v":{"v":4.6728,"d":"4.67 m"}},{"v":5.994399999999995,"d":"5.99 m"},{"$f":"T11*1.18","v":{"v":4.484,"d":"4.48 m"}},{"v":4.4014,"d":"4.40 m"},{"$f":"V11*1.18","v":{"v":4.3187999999999995,"d":"4.32 m"}},{"v":5.593199999999995,"d":"5.59 m"},{"$f":"X11*1.18","v":{"v":4.1772,"d":"4.18 m"}},{"v":5.475200000000003,"d":"5.48 m"},{"$f":"Z11*1.18","v":{"v":4.0474,"d":"4.05 m"}},{"$nulls":15},"5415150+70x30x3",{"$f":"AQ11*1.18","v":{"v":7.386799999999999,"d":"7.39 m"}},{"v":10.3958,"d":"10.40 m"},{"$f":"AS11*1.18","v":{"v":6.784999999999999,"d":"6.79 m"}},{"v":9.617000000000003,"d":"9.62 m"},{"$f":"AU11*1.18","v":{"v":6.312999999999999,"d":"6.31 m"}},{"v":9.038799999999991,"d":"9.04 m"},{"$f":"AW11*1.18","v":{"v":5.9235999999999995,"d":"5.92 m"}},{"v":5.7642999999999995,"d":"5.76 m"},{"$f":"AY11*1.18","v":{"v":5.6049999999999995,"d":"5.61 m"}},{"v":8.047600000000006,"d":"8.05 m"},{"$f":"BA11*1.18","v":{"v":5.333599999999999,"d":"5.33 m"}},{"v":7.811599999999995,"d":"7.81 m"},{"$f":"BC11*1.18","v":{"v":5.085799999999999,"d":"5.09 m"}},{"$nulls":15},"5415150+70x30x3",{"$f":"BT11*1.18","v":{"v":8.4134,"d":"8.41 m"}},{"v":11.8354,"d":"11.84 m"},{"$f":"BV11*1.18","v":{"v":7.728999999999999,"d":"7.73 m"}},{"v":10.985799999999998,"d":"10.99 m"},{"$f":"BX11*1.18","v":{"v":7.1861999999999995,"d":"7.19 m"}},{"v":10.2424,"d":"10.24 m"},{"$f":"BZ11*1.18","v":{"v":6.749599999999999,"d":"6.75 m"}},{"v":6.5607999999999995,"d":"6.56 m"},{"$f":"CB11*1.18","v":{"v":6.372,"d":"6.37 m"}},{"v":9.133200000000008,"d":"9.13 m"},{"$f":"CD11*1.18","v":{"v":6.065199999999999,"d":"6.07 m"}},{"v":8.779199999999987,"d":"8.78 m"},{"$f":"CF11*1.18","v":{"v":5.7938,"d":"5.79 m"}}]
[null,"Unterzug","=","577275+140*40*3",{"$nulls":8},"5415150+Z-Profil",{"$f":"N12*1.19","v":{"v":6.1761,"d":"6.18 m"}},{"v":7.8420999999999985,"d":"7.84 m"},{"$f":"P12*1.19","v":{"v":5.8429,"d":"5.84 m"}},{"v":7.4851000000000045,"d":"7.49 m"},{"$f":"R12*1.19","v":{"v":5.5691999999999995,"d":"5.57 m"}},{"v":7.151899999999996,"d":"7.15 m"},{"$f":"T12*1.19","v":{"v":5.3431,"d":"5.34 m"}},{"v":5.2479000000000005,"d":"5.25 m"},{"$f":"V12*1.19","v":{"v":5.1527,"d":"5.15 m"}},{"v":6.759200000000005,"d":"6.76 m"},{"$f":"X12*1.19","v":{"v":4.9742,"d":"4.97 m"}},{"v":6.402200000000001,"d":"6.40 m"},{"$f":"Z12*1.19","v":{"v":4.8313999999999995,"d":"4.83 m"}},{"$nulls":15},"5415150+Z-Profil",{"$f":"AQ12*1.19","v":{"v":7.639799999999999,"d":"7.64 m"}},{"v":10.733799999999997,"d":"10.73 m"},{"$f":"AS12*1.19","v":{"v":7.021,"d":"7.02 m"}},{"v":9.9484,"d":"9.95 m"},{"$f":"AU12*1.19","v":{"v":6.5331,"d":"6.53 m"}},{"v":9.3653,"d":"9.37 m"},{"$f":"AW12*1.19","v":{"v":6.1285,"d":"6.13 m"}},{"v":5.9619,"d":"5.96 m"},{"$f":"AY12*1.19","v":{"v":5.7953,"d":"5.80 m"}},{"v":8.365700000000006,"d":"8.37 m"},{"$f":"BA12*1.19","v":{"v":5.5097,"d":"5.51 m"}},{"v":8.0087,"d":"8.01 m"},{"$f":"BC12*1.19","v":{"v":5.259799999999999,"d":"5.26 m"}},{"$nulls":15},"5415150+Z-Profil",{"$f":"BT12*1.19","v":{"v":8.698899999999998,"d":"8.70 m"}},{"v":12.268899999999991,"d":"12.27 m"},{"$f":"BV12*1.19","v":{"v":7.9849,"d":"7.98 m"}},{"v":11.340699999999996,"d":"11.34 m"},{"$f":"BX12*1.19","v":{"v":7.4256,"d":"7.43 m"}},{"v":10.591000000000001,"d":"10.59 m"},{"$f":"BZ12*1.19","v":{"v":6.9734,"d":"6.97 m"}},{"v":6.783,"d":"6.78 m"},{"$f":"CB12*1.19","v":{"v":6.5926,"d":"6.59 m"}},{"v":9.484300000000008,"d":"9.48 m"},{"$f":"CD12*1.19","v":{"v":6.271299999999999,"d":"6.27 m"}},{"v":9.127299999999984,"d":"9.13 m"},{"$f":"CF12*1.19","v":{"v":5.9857000000000005,"d":"5.99 m"}}]
[null,"zul. Durchbiegung","=","l/250","Info",{"$nulls":7},"5415151",{"$f":"N13*1.17","v":{"v":4.2002999999999995,"d":"4.20 m"}},{"v":5.428799999999999,"d":"5.43 m"},{"$f":"P13*1.17","v":{"v":3.9545999999999997,"d":"3.95 m"}},{"v":5.077799999999999,"d":"5.08 m"},{"$f":"R13*1.17","v":{"v":3.7674,"d":"3.77 m"}},{"v":4.914,"d":"4.91 m"},{"$f":"T13*1.17","v":{"v":3.6035999999999997,"d":"3.60 m"}},{"v":3.5334,"d":"3.53 m"},{"$f":"V13*1.17","v":{"v":3.4631999999999996,"d":"3.46 m"}},{"v":4.5161999999999995,"d":"4.52 m"},{"$f":"X13*1.17","v":{"v":3.3461999999999996,"d":"3.35 m"}},{"v":4.399199999999996,"d":"4.40 m"},{"$f":"Z13*1.17","v":{"v":3.2409,"d":"3.24 m"}},{"$nulls":15},"5415151",{"$f":"AQ13*1.17","v":{"v":5.124599999999999,"d":"5.12 m"}},{"v":7.2890999999999995,"d":"7.29 m"},{"$f":"AS13*1.17","v":{"v":4.691699999999999,"d":"4.69 m"}},{"v":6.727499999999992,"d":"6.73 m"},{"$f":"AU13*1.17","v":{"v":4.3524,"d":"4.35 m"}},{"v":6.318,"d":"6.32 m"},{"$f":"AW13*1.17","v":{"v":4.0716,"d":"4.07 m"}},{"v":3.9604500000000002,"d":"3.96 m"},{"$f":"AY13*1.17","v":{"v":3.8493,"d":"3.85 m"}},{"v":5.639400000000001,"d":"5.64 m"},{"$f":"BA13*1.17","v":{"v":3.6504,"d":"3.65 m"}},{"v":5.2884,"d":"5.29 m"},{"$f":"BC13*1.17","v":{"v":3.4865999999999997,"d":"3.49 m"}},{"$nulls":15},"5415151",{"$f":"BT13*1.17","v":{"v":5.8266,"d":"5.83 m"}},{"v":8.283600000000003,"d":"8.28 m"},{"$f":"BV13*1.17","v":{"v":5.3351999999999995,"d":"5.34 m"}},{"v":7.651799999999994,"d":"7.65 m"},{"$f":"BX13*1.17","v":{"v":4.9491000000000005,"d":"4.95 m"}},{"v":7.1604000000000045,"d":"7.16 m"},{"$f":"BZ13*1.17","v":{"v":4.6331999999999995,"d":"4.63 m"}},{"v":4.5045,"d":"4.50 m"},{"$f":"CB13*1.17","v":{"v":4.3758,"d":"4.38 m"}},{"v":6.376500000000005,"d":"6.38 m"},{"$f":"CD13*1.17","v":{"v":4.153499999999999,"d":"4.15 m"}},{"v":6.142499999999994,"d":"6.14 m"},{"$f":"CF13*1.17","v":{"v":3.9545999999999997,"d":"3.95 m"}}]
[null,{"$f":"D39","v":{"v":5.01,"d":"5.01 m"}},{"$f":"IF(B42<D42,\"<\",\">\")","v":">"},{"$f":"MIN(H76,AK84,BN84)","v":{"v":4.8128802,"d":"4.81 m"}},{"$nulls":8},"5415151+110x15",{"$f":"N14*1.18","v":{"v":6.6906,"d":"6.69 m"}},{"v":8.342600000000004,"d":"8.34 m"},{"$f":"P14*1.18","v":{"v":6.360199999999999,"d":"6.36 m"}},{"v":7.988599999999993,"d":"7.99 m"},{"$f":"R14*1.18","v":{"v":6.0888,"d":"6.09 m"}},{"v":7.740800000000003,"d":"7.74 m"},{"$f":"T14*1.18","v":{"v":5.852799999999999,"d":"5.85 m"}},{"v":5.7524999999999995,"d":"5.75 m"},{"$f":"V14*1.18","v":{"v":5.6522,"d":"5.65 m"}},{"v":7.245200000000004,"d":"7.25 m"},{"$f":"X14*1.18","v":{"v":5.475199999999999,"d":"5.48 m"}},{"v":7.127199999999993,"d":"7.13 m"},{"$f":"Z14*1.18","v":{"v":5.31,"d":"5.31 m"}},{"$nulls":15},"5415151+110x15",{"$f":"AQ14*1.18","v":{"v":8.6612,"d":"8.66 m"}},{"v":11.906199999999995,"d":"11.91 m"},{"$f":"AS14*1.18","v":{"v":8.0122,"d":"8.01 m"}},{"v":11.127400000000003,"d":"11.13 m"},{"$f":"AU14*1.18","v":{"v":7.492999999999999,"d":"7.49 m"}},{"v":10.549199999999992,"d":"10.55 m"},{"$f":"AW14*1.18","v":{"v":7.0564,"d":"7.06 m"}},{"v":6.8735,"d":"6.87 m"},{"$f":"AY14*1.18","v":{"v":6.6906,"d":"6.69 m"}},{"v":9.4518,"d":"9.45 m"},{"$f":"BA14*1.18","v":{"v":6.3838,"d":"6.38 m"}},{"v":9.097800000000005,"d":"9.10 m"},{"$f":"BC14*1.18","v":{"v":6.112399999999999,"d":"6.11 m"}},{"$nulls":15},"5415151+110x15",{"$f":"BT14*1.18","v":{"v":9.876599999999998,"d":"9.88 m"}},{"v":13.593599999999988,"d":"13.59 m"},{"$f":"BV14*1.18","v":{"v":9.1332,"d":"9.13 m"}},{"v":12.744000000000007,"d":"12.74 m"},{"$f":"BX14*1.18","v":{"v":8.5314,"d":"8.53 m"}},{"v":11.918,"d":"11.92 m"},{"$f":"BZ14*1.18","v":{"v":8.0476,"d":"8.05 m"}},{"v":7.8351999999999995,"d":"7.84 m"},{"$f":"CB14*1.18","v":{"v":7.6228,"d":"7.62 m"}},{"v":10.808800000000002,"d":"10.81 m"},{"$f":"CD14*1.18","v":{"v":7.2688,"d":"7.27 m"}},{"v":10.454800000000006,"d":"10.45 m"},{"$f":"CF14*1.18","v":{"v":6.950199999999999,"d":"6.95 m"}}]
[{"$nulls":3},{"$f":"IF(B42>D42,\"Bedingung nicht erfüllt!\",\"Bedingung erfüllt!\")","v":"Bedingung nicht erfüllt!"},{"$nulls":8},"5415151+Z-Profil",{"$f":"N15*1.19","v":{"v":6.009499999999999,"d":"6.01 m"}},{"v":7.675499999999998,"d":"7.68 m"},{"$f":"P15*1.19","v":{"v":5.6762999999999995,"d":"5.68 m"}},{"v":7.2471,"d":"7.25 m"},{"$f":"R15*1.19","v":{"v":5.414499999999999,"d":"5.41 m"}},{"v":6.99719999999999,"d":"7.00 m"},{"$f":"T15*1.19","v":{"v":5.188400000000001,"d":"5.19 m"}},{"v":5.0932,"d":"5.09 m"},{"$f":"V15*1.19","v":{"v":4.998,"d":"5.00 m"}},{"v":6.497400000000008,"d":"6.50 m"},{"$f":"X15*1.19","v":{"v":4.8313999999999995,"d":"4.83 m"}},{"v":6.259399999999992,"d":"6.26 m"},{"$f":"Z15*1.19","v":{"v":4.6886,"d":"4.69 m"}},{"$nulls":15},"5415151+Z-Profil",{"$f":"AQ15*1.19","v":{"v":7.3065999999999995,"d":"7.31 m"}},{"v":10.281600000000003,"d":"10.28 m"},{"$f":"AS15*1.19","v":{"v":6.711599999999999,"d":"6.71 m"}},{"v":9.496199999999995,"d":"9.50 m"},{"$f":"AU15*1.19","v":{"v":6.2475,"d":"6.25 m"}},{"v":8.913099999999996,"d":"8.91 m"},{"$f":"AW15*1.19","v":{"v":5.8667,"d":"5.87 m"}},{"v":5.70605,"d":"5.71 m"},{"$f":"AY15*1.19","v":{"v":5.5454,"d":"5.55 m"}},{"v":8.008700000000006,"d":"8.01 m"},{"$f":"BA15*1.19","v":{"v":5.271699999999999,"d":"5.27 m"}},{"v":7.651699999999984,"d":"7.65 m"},{"$f":"BC15*1.19","v":{"v":5.0337000000000005,"d":"5.03 m"}},{"$nulls":15},"5415151+Z-Profil",{"$f":"BT15*1.19","v":{"v":8.3181,"d":"8.32 m"}},{"v":11.709600000000002,"d":"11.71 m"},{"$f":"BV15*1.19","v":{"v":7.639799999999999,"d":"7.64 m"}},{"v":10.852799999999998,"d":"10.85 m"},{"$f":"BX15*1.19","v":{"v":7.104299999999999,"d":"7.10 m"}},{"v":10.186399999999994,"d":"10.19 m"},{"$f":"BZ15*1.19","v":{"v":6.664,"d":"6.66 m"}},{"v":6.4855,"d":"6.49 m"},{"$f":"CB15*1.19","v":{"v":6.3069999999999995,"d":"6.31 m"}},{"v":9.198699999999992,"d":"9.20 m"},{"$f":"CD15*1.19","v":{"v":5.9857000000000005,"d":"5.99 m"}},{"v":8.603700000000007,"d":"8.60 m"},{"$f":"CF15*1.19","v":{"v":5.7238999999999995,"d":"5.72 m"}}]
[null,"Durchbiegung w","=",{"$f":"(1000/VLOOKUP($D$41,Daten!$A$22:$B$25,2))*$D$39^4/$H$76^3","v":{"v":22.60454346245925,"d":"23 mm"}},{"$nulls":8},"5415152",{"$f":"N16*1.21","v":{"v":6.1105,"d":"6.11 m"}},{"v":7.804500000000004,"d":"7.80 m"},{"$f":"P16*1.21","v":{"v":5.771699999999999,"d":"5.77 m"}},{"v":7.514099999999994,"d":"7.51 m"},{"$f":"R16*1.21","v":{"v":5.4813,"d":"5.48 m"}},{"v":7.090600000000004,"d":"7.09 m"},{"$f":"T16*1.21","v":{"v":5.251399999999999,"d":"5.25 m"}},{"v":5.154599999999999,"d":"5.15 m"},{"$f":"V16*1.21","v":{"v":5.057799999999999,"d":"5.06 m"}},{"v":6.582399999999996,"d":"6.58 m"},{"$f":"X16*1.21","v":{"v":4.8884,"d":"4.89 m"}},{"v":6.340399999999999,"d":"6.34 m"},{"$f":"Z16*1.21","v":{"v":4.7432,"d":"4.74 m"}},{"$nulls":15},"5415152",{"$f":"AQ16*1.21","v":{"v":7.865,"d":"7.87 m"}},{"v":11.192500000000004,"d":"11.19 m"},{"$f":"AS16*1.21","v":{"v":7.1995,"d":"7.20 m"}},{"v":10.321300000000004,"d":"10.32 m"},{"$f":"AU16*1.21","v":{"v":6.679199999999999,"d":"6.68 m"}},{"v":9.558999999999994,"d":"9.56 m"},{"$f":"AW16*1.21","v":{"v":6.267799999999999,"d":"6.27 m"}},{"v":6.09235,"d":"6.09 m"},{"$f":"AY16*1.21","v":{"v":5.916899999999999,"d":"5.92 m"}},{"v":8.639399999999993,"d":"8.64 m"},{"$f":"BA16*1.21","v":{"v":5.6144,"d":"5.61 m"}},{"v":8.1554,"d":"8.16 m"},{"$f":"BC16*1.21","v":{"v":5.3603,"d":"5.36 m"}},{"$nulls":15},"5415152",{"$f":"BT16*1.21","v":{"v":8.941899999999999,"d":"8.94 m"}},{"v":12.692899999999998,"d":"12.69 m"},{"$f":"BV16*1.21","v":{"v":8.191699999999999,"d":"8.19 m"}},{"v":11.749099999999995,"d":"11.75 m"},{"$f":"BX16*1.21","v":{"v":7.5988,"d":"7.60 m"}},{"v":10.9021,"d":"10.90 m"},{"$f":"BZ16*1.21","v":{"v":7.126899999999999,"d":"7.13 m"}},{"v":6.927249999999999,"d":"6.93 m"},{"$f":"CB16*1.21","v":{"v":6.727599999999999,"d":"6.73 m"}},{"v":9.77679999999999,"d":"9.78 m"},{"$f":"CD16*1.21","v":{"v":6.3888,"d":"6.39 m"}},{"v":9.292799999999996,"d":"9.29 m"},{"$f":"CF16*1.21","v":{"v":6.0984,"d":"6.10 m"}}]
[null,"zul. Durchbiegung wzul.","=",{"$f":"D39*1000/VLOOKUP($D$41,Daten!$A$22:$B$25,2)","v":{"v":20.04,"d":"20 mm"}},{"$nulls":8},"5415152+140x15",{"$f":"N17*1.18","v":{"v":8.6022,"d":"8.60 m"}},{"v":10.667200000000001,"d":"10.67 m"},{"$f":"P17*1.18","v":{"v":8.1892,"d":"8.19 m"}},{"v":10.242399999999995,"d":"10.24 m"},{"$f":"R17*1.18","v":{"v":7.847,"d":"7.85 m"}},{"v":9.912000000000004,"d":"9.91 m"},{"$f":"T17*1.18","v":{"v":7.552,"d":"7.55 m"}},{"v":7.4281,"d":"7.43 m"},{"$f":"V17*1.18","v":{"v":7.3042,"d":"7.30 m"}},{"v":9.321999999999997,"d":"9.32 m"},{"$f":"X17*1.18","v":{"v":7.08,"d":"7.08 m"}},{"v":8.968000000000004,"d":"8.97 m"},{"$f":"Z17*1.18","v":{"v":6.8911999999999995,"d":"6.89 m"}},{"$nulls":15},"5415152+140x15",{"$f":"AQ17*1.18","v":{"v":11.209999999999999,"d":"11.21 m"}},{"v":15.221999999999994,"d":"15.22 m"},{"$f":"AS17*1.18","v":{"v":10.4076,"d":"10.41 m"}},{"v":14.372400000000013,"d":"14.37 m"},{"$f":"AU17*1.18","v":{"v":9.746799999999999,"d":"9.75 m"}},{"v":13.546399999999993,"d":"13.55 m"},{"$f":"AW17*1.18","v":{"v":9.203999999999999,"d":"9.20 m"}},{"v":8.9739,"d":"8.97 m"},{"$f":"AY17*1.18","v":{"v":8.7438,"d":"8.74 m"}},{"v":12.354600000000012,"d":"12.35 m"},{"$f":"BA17*1.18","v":{"v":8.3426,"d":"8.34 m"}},{"v":11.764599999999996,"d":"11.76 m"},{"$f":"BC17*1.18","v":{"v":8.000399999999999,"d":"8.00 m"}},{"$nulls":15},"5415152+140x15",{"$f":"BT17*1.18","v":{"v":12.7912,"d":"12.79 m"}},{"v":17.393200000000004,"d":"17.39 m"},{"$f":"BV17*1.18","v":{"v":11.8708,"d":"11.87 m"}},{"v":16.402,"d":"16.40 m"},{"$f":"BX17*1.18","v":{"v":11.115599999999999,"d":"11.12 m"}},{"v":15.493399999999987,"d":"15.49 m"},{"$f":"BZ17*1.18","v":{"v":10.4902,"d":"10.49 m"}},{"v":10.2247,"d":"10.22 m"},{"$f":"CB17*1.18","v":{"v":9.9592,"d":"9.96 m"}},{"v":13.994799999999994,"d":"13.99 m"},{"$f":"CD17*1.18","v":{"v":9.5108,"d":"9.51 m"}},{"v":13.522800000000007,"d":"13.52 m"},{"$f":"CF17*1.18","v":{"v":9.109599999999999,"d":"9.11 m"}}]
[null,"1-Feldbalken b",{"$nulls":4},"2a) Tabellenwert l",{"$f":"O53","v":{"v":3.5334,"d":"3.53 m"}},{"$nulls":4},"5415152+70x30x3",{"$f":"N18*1.2","v":{"v":6.396,"d":"6.40 m"}},{"v":8.136,"d":"8.14 m"},{"$f":"P18*1.2","v":{"v":6.048,"d":"6.05 m"}},{"v":7.776000000000002,"d":"7.78 m"},{"$f":"R18*1.2","v":{"v":5.76,"d":"5.76 m"}},{"v":7.355999999999996,"d":"7.36 m"},{"$f":"T18*1.2","v":{"v":5.532,"d":"5.53 m"}},{"v":5.430000000000001,"d":"5.43 m"},{"$f":"V18*1.2","v":{"v":5.328,"d":"5.33 m"}},{"v":6.8400000000000105,"d":"6.84 m"},{"$f":"X18*1.2","v":{"v":5.159999999999999,"d":"5.16 m"}},{"v":6.719999999999995,"d":"6.72 m"},{"$f":"Z18*1.2","v":{"v":5.004,"d":"5.00 m"}},{"$nulls":15},"5415152+70x30x3",{"$f":"AQ18*1.2","v":{"v":8.459999999999999,"d":"8.46 m"}},{"v":11.879999999999995,"d":"11.88 m"},{"$f":"AS18*1.2","v":{"v":7.776,"d":"7.78 m"}},{"v":11.016,"d":"11.02 m"},{"$f":"AU18*1.2","v":{"v":7.236,"d":"7.24 m"}},{"v":10.343999999999998,"d":"10.34 m"},{"$f":"AW18*1.2","v":{"v":6.792,"d":"6.79 m"}},{"v":6.612,"d":"6.61 m"},{"$f":"AY18*1.2","v":{"v":6.432,"d":"6.43 m"}},{"v":9.348000000000008,"d":"9.35 m"},{"$f":"BA18*1.2","v":{"v":6.108,"d":"6.11 m"}},{"v":8.74799999999999,"d":"8.75 m"},{"$f":"BC18*1.2","v":{"v":5.844,"d":"5.84 m"}},{"$nulls":15},"5415152+70x30x3",{"$f":"BT18*1.2","v":{"v":9.636,"d":"9.64 m"}},{"v":13.535999999999998,"d":"13.54 m"},{"$f":"BV18*1.2","v":{"v":8.856,"d":"8.86 m"}},{"v":12.600000000000005,"d":"12.60 m"},{"$f":"BX18*1.2","v":{"v":8.232,"d":"8.23 m"}},{"v":11.759999999999993,"d":"11.76 m"},{"$f":"BZ18*1.2","v":{"v":7.728,"d":"7.73 m"}},{"v":7.518,"d":"7.52 m"},{"$f":"CB18*1.2","v":{"v":7.308,"d":"7.31 m"}},{"v":10.44,"d":"10.44 m"},{"$f":"CD18*1.2","v":{"v":6.96,"d":"6.96 m"}},{"v":10.08,"d":"10.08 m"},{"$f":"CF18*1.2","v":{"v":6.648,"d":"6.65 m"}}]
[null,"Durchbiegung w","=",{"$f":"(1000/VLOOKUP($D$41,Daten!$A$22:$B$25,2))*$D$39^4/($H$76*H73)^3","v":{"v":22.60454346245925,"d":"23 mm"}},null,null,"2a) Korrigierter lzul1",{"$f":"H46*H29*H30*H31*H32*H33","v":{"v":3.4697988,"d":"3.47 m"}},{"$nulls":4},"5415152+Z-Profil",{"$f":"N19*1.2","v":{"v":7.092,"d":"7.09 m"}},{"v":9.012000000000002,"d":"9.01 m"},{"$f":"P19*1.2","v":{"v":6.707999999999999,"d":"6.71 m"}},{"v":8.579999999999997,"d":"8.58 m"},{"$f":"R19*1.2","v":{"v":6.396,"d":"6.40 m"}},{"v":8.243999999999993,"d":"8.24 m"},{"$f":"T19*1.2","v":{"v":6.132000000000001,"d":"6.13 m"}},{"v":6.018000000000001,"d":"6.02 m"},{"$f":"V19*1.2","v":{"v":5.904,"d":"5.90 m"}},{"v":7.6320000000000014,"d":"7.63 m"},{"$f":"X19*1.2","v":{"v":5.712,"d":"5.71 m"}},{"v":7.3919999999999995,"d":"7.39 m"},{"$f":"Z19*1.2","v":{"v":5.544,"d":"5.54 m"}},{"$nulls":15},"5415152+Z-Profil",{"$f":"AQ19*1.2","v":{"v":9.347999999999999,"d":"9.35 m"}},{"v":13.127999999999993,"d":"13.13 m"},{"$f":"AS19*1.2","v":{"v":8.592,"d":"8.59 m"}},{"v":12.192000000000004,"d":"12.19 m"},{"$f":"AU19*1.2","v":{"v":7.992,"d":"7.99 m"}},{"v":11.435999999999996,"d":"11.44 m"},{"$f":"AW19*1.2","v":{"v":7.5,"d":"7.50 m"}},{"v":7.296,"d":"7.30 m"},{"$f":"AY19*1.2","v":{"v":7.092,"d":"7.09 m"}},{"v":10.223999999999998,"d":"10.22 m"},{"$f":"BA19*1.2","v":{"v":6.744,"d":"6.74 m"}},{"v":9.743999999999996,"d":"9.74 m"},{"$f":"BC19*1.2","v":{"v":6.444,"d":"6.44 m"}},{"$nulls":15},"5415152+Z-Profil",{"$f":"BT19*1.2","v":{"v":10.632,"d":"10.63 m"}},{"v":14.892000000000003,"d":"14.89 m"},{"$f":"BV19*1.2","v":{"v":9.78,"d":"9.78 m"}},{"v":13.883999999999997,"d":"13.88 m"},{"$f":"BX19*1.2","v":{"v":9.096,"d":"9.10 m"}},{"v":12.959999999999994,"d":"12.96 m"},{"$f":"BZ19*1.2","v":{"v":8.544,"d":"8.54 m"}},{"v":8.31,"d":"8.31 m"},{"$f":"CB19*1.2","v":{"v":8.076,"d":"8.08 m"}},{"v":11.640000000000008,"d":"11.64 m"},{"$f":"CD19*1.2","v":{"v":7.68,"d":"7.68 m"}},{"v":11.159999999999995,"d":"11.16 m"},{"$f":"CF19*1.2","v":{"v":7.332,"d":"7.33 m"}}]
[{"$nulls":12},"543003",{"$f":"N21*0.86","v":{"v":4.4634,"d":"4.46 m"}},{"v":5.710399999999998,"d":"5.71 m"},{"$f":"P21*0.86","v":{"v":4.214,"d":"4.21 m"}},{"v":5.400800000000006,"d":"5.40 m"},{"$f":"R21*0.86","v":{"v":4.0161999999999995,"d":"4.02 m"}},{"v":5.220199999999997,"d":"5.22 m"},{"$f":"T21*0.86","v":{"v":3.8442,"d":"3.84 m"}},{"v":3.7754,"d":"3.78 m"},{"$f":"V21*0.86","v":{"v":3.7065999999999995,"d":"3.71 m"}},{"v":4.867599999999996,"d":"4.87 m"},{"$f":"X21*0.86","v":{"v":3.5776,"d":"3.58 m"}},{"v":4.609599999999997,"d":"4.61 m"},{"$f":"Z21*0.86","v":{"v":3.4744,"d":"3.47 m"}},{"$nulls":15},"543003",{"$f":"AQ21*0.86","v":{"v":6.3468,"d":"6.35 m"}},{"v":8.969800000000003,"d":"8.97 m"},{"$f":"AS21*0.86","v":{"v":5.8222,"d":"5.82 m"}},{"v":8.299,"d":"8.30 m"},{"$f":"AU21*0.86","v":{"v":5.4094,"d":"5.41 m"}},{"v":7.757199999999997,"d":"7.76 m"},{"$f":"AW21*0.86","v":{"v":5.074,"d":"5.07 m"}},{"v":4.9321,"d":"4.93 m"},{"$f":"AY21*0.86","v":{"v":4.7902000000000005,"d":"4.79 m"}},{"v":6.880000000000006,"d":"6.88 m"},{"$f":"BA21*0.86","v":{"v":4.558,"d":"4.56 m"}},{"v":6.622000000000002,"d":"6.62 m"},{"$f":"BC21*0.86","v":{"v":4.3515999999999995,"d":"4.35 m"}},{"$nulls":15},"543003",{"$f":"BT21*0.86","v":{"v":7.215400000000001,"d":"7.22 m"}},{"v":10.182400000000005,"d":"10.18 m"},{"$f":"BV21*0.86","v":{"v":6.622,"d":"6.62 m"}},{"v":9.459999999999999,"d":"9.46 m"},{"$f":"BX21*0.86","v":{"v":6.149,"d":"6.15 m"}},{"v":8.797799999999999,"d":"8.80 m"},{"$f":"BZ21*0.86","v":{"v":5.7706,"d":"5.77 m"}},{"v":5.6115,"d":"5.61 m"},{"$f":"CB21*0.86","v":{"v":5.4524,"d":"5.45 m"}},{"v":7.929200000000007,"d":"7.93 m"},{"$f":"CD21*0.86","v":{"v":5.177199999999999,"d":"5.18 m"}},{"v":7.499199999999986,"d":"7.50 m"},{"$f":"CF21*0.86","v":{"v":4.945,"d":"4.95 m"}}]
[{"$nulls":12},"543003+70x30x3",{"$f":"N22*0.98","v":{"v":5.3312,"d":"5.33 m"}},{"v":6.752199999999997,"d":"6.75 m"},{"$f":"P22*0.98","v":{"v":5.047000000000001,"d":"5.05 m"}},{"v":6.458200000000005,"d":"6.46 m"},{"$f":"R22*0.98","v":{"v":4.8118,"d":"4.81 m"}},{"v":6.1152000000000015,"d":"6.12 m"},{"$f":"T22*0.98","v":{"v":4.6255999999999995,"d":"4.63 m"}},{"v":4.5423,"d":"4.54 m"},{"$f":"V22*0.98","v":{"v":4.459,"d":"4.46 m"}},{"v":5.781999999999994,"d":"5.78 m"},{"$f":"X22*0.98","v":{"v":4.312,"d":"4.31 m"}},{"v":5.586000000000006,"d":"5.59 m"},{"$f":"Z22*0.98","v":{"v":4.1846,"d":"4.18 m"}},{"$nulls":15},"543003+70x30x3",{"$f":"AQ22*0.98","v":{"v":7.7714,"d":"7.77 m"}},{"v":10.8584,"d":"10.86 m"},{"$f":"AS22*0.98","v":{"v":7.154,"d":"7.15 m"}},{"v":10.094000000000001,"d":"10.09 m"},{"$f":"AU22*0.98","v":{"v":6.664,"d":"6.66 m"}},{"v":9.476599999999994,"d":"9.48 m"},{"$f":"AW22*0.98","v":{"v":6.2622,"d":"6.26 m"}},{"v":6.0956,"d":"6.10 m"},{"$f":"AY22*0.98","v":{"v":5.928999999999999,"d":"5.93 m"}},{"v":8.486799999999993,"d":"8.49 m"},{"$f":"BA22*0.98","v":{"v":5.6448,"d":"5.64 m"}},{"v":8.192800000000002,"d":"8.19 m"},{"$f":"BC22*0.98","v":{"v":5.39,"d":"5.39 m"}},{"$nulls":15},"543003+70x30x3",{"$f":"BT22*0.98","v":{"v":8.8494,"d":"8.85 m"}},{"v":12.377399999999994,"d":"12.38 m"},{"$f":"BV22*0.98","v":{"v":8.1438,"d":"8.14 m"}},{"v":11.495400000000004,"d":"11.50 m"},{"$f":"BX22*0.98","v":{"v":7.5852,"d":"7.59 m"}},{"v":10.740799999999998,"d":"10.74 m"},{"$f":"BZ22*0.98","v":{"v":7.1344,"d":"7.13 m"}},{"v":6.9433,"d":"6.94 m"},{"$f":"CB22*0.98","v":{"v":6.752199999999999,"d":"6.75 m"}},{"v":9.750999999999998,"d":"9.75 m"},{"$f":"CD22*0.98","v":{"v":6.419,"d":"6.42 m"}},{"v":9.261,"d":"9.26 m"},{"$f":"CF22*0.98","v":{"v":6.134799999999999,"d":"6.13 m"}}]
[{"$nulls":6},"3a) Korrekturfaktoren Rinne",null,null,"3a) Dachneigung","3a) k"]
[{"$nulls":6},"3a) Verglasung",{"$f":"H2","v":{"v":1,"d":"1.000"}},null,{"v":1,"d":"1.00 °"},{"v":1,"d":"1.000"}]
[{"$nulls":6},"3a) Schnee sDA ",{"$f":"H3","v":0.982},null,{"v":10,"d":"10.00 °"},{"v":1,"d":"1.000"},null,"Seitenträger","Sparren-Achsabstand","l",{"$nulls":20},"2b) Tabellenwert l",{"$f":"AR53","v":{"v":3.9604500000000002,"d":"3.96 m"}},{"$nulls":4},"Seitenträger","Sparren-Achsabstand","l",{"$nulls":20},"2c) Tabellenwert l",{"$f":"BU53","v":{"v":4.5045,"d":"4.50 m"}},{"$nulls":4},"Seitenträger","Sparren-Achsabstand","l"]
[{"$nulls":6},"3a) Wind",{"$f":"H4","v":{"v":1,"d":"1.000"}},null,{"$f":"IF(AND($D$9>J52,$D$9<J54),$D$9,\"nicht interpolieren\")","v":"nicht interpolieren"},{"$f":"K52-(K52-K54)*(J53-J52)/(J54-J52)","v":{"$error":"#VALUE!"}},null,{"$f":"IF($D$19=\"\",\"\",MATCH($D$19,M32:M50))","v":10},{"$f":"IF($D$12=\"\",\"\",MATCH($D$12,N31:Z31,0))","v":8},{"$f":"IF(OR($D$19=\"\",$D$12=\"\"),0,INDEX(N32:Z50,M53,N53))","v":{"v":3.5334,"d":"3.53 m"}},{"$nulls":20},"2b) Korrigierter lzul2",{"$f":"AK52*AK32*AK33*AK34*AK35*AK36","v":{"v":3.8574783000000004,"d":"3.86 m"}},{"$nulls":4},{"$f":"IF($D$19=\"\",\"\",MATCH($D$19,AP32:AP50))","v":10},{"$f":"IF($D$12=\"\",\"\",MATCH($D$12,AQ31:BC31,0))","v":8},{"$f":"IF(OR($D$19=\"\",$D$12=\"\"),0,INDEX(AQ32:BC50,AP53,AQ53))","v":{"v":3.9604500000000002,"d":"3.96 m"}},{"$nulls":20},"2c) Korrigierter lzul3",{"$f":"BN52*BN32*BN33*BN34*BN35*BN36","v":{"v":45045,"d":"45,045.00 m"}},{"$nulls":4},{"$f":"IF($D$19=\"\",\"\",MATCH($D$19,BS32:BS50))","v":10},{"$f":"IF($D$12=\"\",\"\",MATCH($D$12,BT31:CF31,0))","v":8},{"$f":"IF(OR($D$19=\"\",$D$12=\"\"),0,INDEX(BT32:CF50,BS53,BT53))","v":{"v":4.5045,"d":"4.50 m"}}]
[{"$nulls":6},"3a) Dachneigung",{"$f":"VLOOKUP($D$9,J51:K54,2)","v":{"v":1,"d":"1.000"}},null,{"v":30,"d":"30.00 °"},{"v":0.99,"d":"0.990"}]
[{"$nulls":6},"3a) Faktor Trägergewicht",{"$f":"IF(AND($D$12<0.8,OR($D$11=$M$2,$D$11=$M$6,$D$11=$M$8,$D$11=$M$13)),0.99,IF(AND($D$12>=0.8,OR($D$11=$M$3,$D$11=$M$7,$D$11=$M$9,$D$11=$M$14,$D$11=$M$15)),0.97,IF(AND($D$12<0.8,OR($D$11=$M$3,$D$11=$M$7,$D$11=$M$9,$D$11=$M$14,$D$11=$M$15)),0.95,1)))","v":{"v":1,"d":"1.000"}}]
[{"$nulls":6},"3a) zul. Durchbiegung",{"$f":"VLOOKUP($D$27,Daten!$A$44:$B$47,2)","v":{"v":0.93,"d":"0.930"}},{"$nulls":4},"3a) Rinne",{"v":1,"d":"1.00 m"},{"$f":"IF(AND('Ermittlung Schneelast'!$D$19>1,'Ermittlung Schneelast'!$D$19<1.5),'Ermittlung Schneelast'!$D$19,0)","v":{"v":0,"d":"0.00 m"}},{"v":1.5,"d":"1.50 m"},{"$f":"IF(AND('Ermittlung Schneelast'!$D$19>1.5,'Ermittlung Schneelast'!$D$19<2),'Ermittlung Schneelast'!$D$19,0)","v":{"v":0,"d":"0.00 m"}},{"v":2,"d":"2.00 m"},{"$f":"IF(AND('Ermittlung Schneelast'!$D$19>2,'Ermittlung Schneelast'!$D$19<2.5),'Ermittlung Schneelast'!$D$19,0)","v":{"v":0,"d":"0.00 m"}},{"v":2.5,"d":"2.50 m"},{"$f":"IF(AND('Ermittlung Schneelast'!$D$19>2.5,'Ermittlung Schneelast'!$D$19<3),'Ermittlung Schneelast'!$D$19,0)","v":{"v":0,"d":"0.00 m"}},{"v":3,"d":"3.00 m"},{"$f":"IF(AND('Ermittlung Schneelast'!$D$19>3,'Ermittlung Schneelast'!$D$19<3.5),'Ermittlung Schneelast'!$D$19,0)","v":{"v":0,"d":"0.00 m"}},{"v":3.5,"d":"3.50 m"},{"$f":"IF(AND('Ermittlung Schneelast'!$D$19>3.5,'Ermittlung Schneelast'!$D$19<4),'Ermittlung Schneelast'!$D$19,0)","v":{"v":0,"d":"0.00 m"}},{"v":4,"d":"4.00 m"},{"$f":"IF(AND('Ermittlung Schneelast'!$D$19>4,'Ermittlung Schneelast'!$D$19<4.5),'Ermittlung Schneelast'!$D$19,0)","v":{"v":0,"d":"0.00 m"}},{"v":4.5,"d":"4.50 m"},{"$f":"IF(AND('Ermittlung Schneelast'!$D$19>4.5,'Ermittlung Schneelast'!$D$19<5),'Ermittlung Schneelast'!$D$19,0)","v":{"v":0,"d":"0.00 m"}},{"v":5,"d":"5.00 m"},{"$f":"IF(AND('Ermittlung Schneelast'!$D$19>5,'Ermittlung Schneelast'!$D$19<5.5),'Ermittlung Schneelast'!$D$19,0)","v":{"v":0,"d":"0.00 m"}},{"v":5.5,"d":"5.50 m"},{"$f":"IF(AND('Ermittlung Schneelast'!$D$19>5.5,'Ermittlung Schneelast'!$D$19<6),'Ermittlung Schneelast'!$D$19,0)","v":{"v":0,"d":"0.00 m"}},{"v":6,"d":"6.00 m"},null,"3b) Korrekturfaktoren Rinne",{"$nulls":5},"3b) Rinne",{"v":1,"d":"1.00 m"},{"$f":"IF(AND('Ermittlung Schneelast'!$D$19>1,'Ermittlung Schneelast'!$D$19<1.5),'Ermittlung Schneelast'!$D$19,0)","v":{"v":0,"d":"0.00 m"}},{"v":1.5,"d":"1.50 m"},{"$f":"IF(AND('Ermittlung Schneelast'!$D$19>1.5,'Ermittlung Schneelast'!$D$19<2),'Ermittlung Schneelast'!$D$19,0)","v":{"v":0,"d":"0.00 m"}},{"v":2,"d":"2.00 m"},{"$f":"IF(AND('Ermittlung Schneelast'!$D$19>2,'Ermittlung Schneelast'!$D$19<2.5),'Ermittlung Schneelast'!$D$19,0)","v":{"v":0,"d":"0.00 m"}},{"v":2.5,"d":"2.50 m"},{"$f":"IF(AND('Ermittlung Schneelast'!$D$19>2.5,'Ermittlung Schneelast'!$D$19<3),'Ermittlung Schneelast'!$D$19,0)","v":{"v":0,"d":"0.00 m"}},{"v":3,"d":"3.00 m"},{"$f":"IF(AND('Ermittlung Schneelast'!$D$19>3,'Ermittlung Schneelast'!$D$19<3.5),'Ermittlung Schneelast'!$D$19,0)","v":{"v":0,"d":"0.00 m"}},{"v":3.5,"d":"3.50 m"},{"$f":"IF(AND('Ermittlung Schneelast'!$D$19>3.5,'Ermittlung Schneelast'!$D$19<4),'Ermittlung Schneelast'!$D$19,0)","v":{"v":0,"d":"0.00 m"}},{"v":4,"d":"4.00 m"},{"$f":"IF(AND('Ermittlung Schneelast'!$D$19>4,'Ermittlung Schneelast'!$D$19<4.5),'Ermittlung Schneelast'!$D$19,0)","v":{"v":0,"d":"0.00 m"}},{"v":4.5,"d":"4.50 m"},{"$f":"IF(AND('Ermittlung Schneelast'!$D$19>4.5,'Ermittlung Schneelast'!$D$19<5),'Ermittlung Schneelast'!$D$19,0)","v":{"v":0,"d":"0.00 m"}},{"v":5,"d":"5.00 m"},{"$f":"IF(AND('Ermittlung Schneelast'!$D$19>5,'Ermittlung Schneelast'!$D$19<5.5),'Ermittlung Schneelast'!$D$19,0)","v":{"v":0,"d":"0.00 m"}},{"v":5.5,"d":"5.50 m"},{"$f":"IF(AND('Ermittlung Schneelast'!$D$19>5.5,'Ermittlung Schneelast'!$D$19<6),'Ermittlung Schneelast'!$D$19,0)","v":{"v":0,"d":"0.00 m"}},{"v":6,"d":"6.00 m"},null,"3c) Korrekturfaktoren Rinne",{"$nulls":5},"3c) Rinne",{"v":1,"d":"1.00 m"},{"$f":"IF(AND('Ermittlung Schneelast'!$D$19>1,'Ermittlung Schneelast'!$D$19<1.5),'Ermittlung Schneelast'!$D$19,0)","v":{"v":0,"d":"0.00 m"}},{"v":1.5,"d":"1.50 m"},{"$f":"IF(AND('Ermittlung Schneelast'!$D$19>1.5,'Ermittlung Schneelast'!$D$19<2),'Ermittlung Schneelast'!$D$19,0)","v":{"v":0,"d":"0.00 m"}},{"v":2,"d":"2.00 m"},{"$f":"IF(AND('Ermittlung Schneelast'!$D$19>2,'Ermittlung Schneelast'!$D$19<2.5),'Ermittlung Schneelast'!$D$19,0)","v":{"v":0,"d":"0.00 m"}},{"v":2.5,"d":"2.50 m"},{"$f":"IF(AND('Ermittlung Schneelast'!$D$19>2.5,'Ermittlung Schneelast'!$D$19<3),'Ermittlung Schneelast'!$D$19,0)","v":{"v":0,"d":"0.00 m"}},{"v":3,"d":"3.00 m"},{"$f":"IF(AND('Ermittlung Schneelast'!$D$19>3,'Ermittlung Schneelast'!$D$19<3.5),'Ermittlung Schneelast'!$D$19,0)","v":{"v":0,"d":"0.00 m"}},{"v":3.5,"d":"3.50 m"},{"$f":"IF(AND('Ermittlung Schneelast'!$D$19>3.5,'Ermittlung Schneelast'!$D$19<4),'Ermittlung Schneelast'!$D$19,0)","v":{"v":0,"d":"0.00 m"}},{"v":4,"d":"4.00 m"},{"$f":"IF(AND('Ermittlung Schneelast'!$D$19>4,'Ermittlung Schneelast'!$D$19<4.5),'Ermittlung Schneelast'!$D$19,0)","v":{"v":0,"d":"0.00 m"}},{"v":4.5,"d":"4.50 m"},{"$f":"IF(AND('Ermittlung Schneelast'!$D$19>4.5,'Ermittlung Schneelast'!$D$19<5),'Ermittlung Schneelast'!$D$19,0)","v":{"v":0,"d":"0.00 m"}},{"v":5,"d":"5.00 m"},{"$f":"IF(AND('Ermittlung Schneelast'!$D$19>5,'Ermittlung Schneelast'!$D$19<5.5),'Ermittlung Schneelast'!$D$19,0)","v":{"v":0,"d":"0.00 m"}},{"v":5.5,"d":"5.50 m"},{"$f":"IF(AND('Ermittlung Schneelast'!$D$19>5.5,'Ermittlung Schneelast'!$D$19<6),'Ermittlung Schneelast'!$D$19,0)","v":{"v":0,"d":"0.00 m"}},{"v":6,"d":"6.00 m"}]
[{"$nulls":12},"26101",{"$f":"P57+(R57-T57)","v":{"v":3.98,"d":"3.98 m"}},{"$f":"N57-(N57-P57)*(O$56-N$56)/(P$56-N$56)","v":{"v":4.48,"d":"4.48 m"}},{"$f":"R57+(R57-T57)","v":{"v":3.73,"d":"3.73 m"}},{"$f":"P57-(P57-R57)*(Q$56-P$56)/(R$56-P$56)","v":{"v":4.48,"d":"4.48 m"}},{"v":3.48,"d":"3.48 m"},{"$f":"R57-(R57-T57)*(S$56-R$56)/(T$56-R$56)","v":{"v":4.48,"d":"4.48 m"}},{"v":3.23,"d":"3.23 m"},{"$f":"T57-(T57-V57)*(U$56-T$56)/(V$56-T$56)","v":{"v":4.130000000000001,"d":"4.13 m"}},{"v":3.05,"d":"3.05 m"},{"$f":"V57-(V57-X57)*(W$56-V$56)/(X$56-V$56)","v":{"v":3.9499999999999993,"d":"3.95 m"}},{"v":2.9,"d":"2.90 m"},{"$f":"X57-(X57-Z57)*(Y$56-X$56)/(Z$56-X$56)","v":{"v":3.809999999999999,"d":"3.81 m"}},{"v":2.77,"d":"2.77 m"},{"$f":"Z57-(Z57-AB57)*(AA$56-Z$56)/(AB$56-Z$56)","v":{"v":3.5700000000000007,"d":"3.57 m"}},{"v":2.67,"d":"2.67 m"},{"$f":"AB57-(AB57-AD57)*(AC$56-AB$56)/(AD$56-AB$56)","v":{"v":3.4799999999999986,"d":"3.48 m"}},{"v":2.58,"d":"2.58 m"},{"$f":"AD57-(AD57-AF57)*(AE$56-AD$56)/(AF$56-AD$56)","v":{"v":3.380000000000001,"d":"3.38 m"}},{"v":2.5,"d":"2.50 m"},{"$f":"AF57-(AF57-AH57)*(AG$56-AF$56)/(AH$56-AF$56)","v":{"v":3.2699999999999982,"d":"3.27 m"}},{"v":2.43,"d":"2.43 m"},null,"3b) Verglasung",{"$f":"AK2","v":{"v":1,"d":"1.000"}},{"$nulls":4},"26101",{"$f":"AS57+(AU57-AW57)","v":{"v":4.84,"d":"4.84 m"}},{"$f":"AQ57-(AQ57-AS57)*(AR$56-AQ$56)/(AS$56-AQ$56)","v":{"v":5.68,"d":"5.68 m"}},{"$f":"AU57+(AU57-AW57)","v":{"v":4.42,"d":"4.42 m"}},{"$f":"AS57-(AS57-AU57)*(AT$56-AS$56)/(AU$56-AS$56)","v":{"v":5.68,"d":"5.68 m"}},{"v":4,"d":"4.00 m"},{"$f":"AU57-(AU57-AW57)*(AV$56-AU$56)/(AW$56-AU$56)","v":{"v":5.68,"d":"5.68 m"}},{"v":3.58,"d":"3.58 m"},{"$f":"AW57-(AW57-AY57)*(AX$56-AW$56)/(AY$56-AW$56)","v":{"v":5.080000000000002,"d":"5.08 m"}},{"v":3.28,"d":"3.28 m"},{"$f":"AY57-(AY57-BA57)*(AZ$56-AY$56)/(BA$56-AY$56)","v":{"v":4.719999999999999,"d":"4.72 m"}},{"v":3.04,"d":"3.04 m"},{"$f":"BA57-(BA57-BC57)*(BB$56-BA$56)/(BC$56-BA$56)","v":{"v":4.369999999999999,"d":"4.37 m"}},{"v":2.85,"d":"2.85 m"},{"$f":"BC57-(BC57-BE57)*(BD$56-BC$56)/(BE$56-BC$56)","v":{"v":4.209999999999999,"d":"4.21 m"}},{"v":2.68,"d":"2.68 m"},{"$f":"BE57-(BE57-BG57)*(BF$56-BE$56)/(BG$56-BE$56)","v":{"v":3.850000000000003,"d":"3.85 m"}},{"v":2.55,"d":"2.55 m"},{"$f":"BG57-(BG57-BI57)*(BH$56-BG$56)/(BI$56-BG$56)","v":{"v":3.7499999999999964,"d":"3.75 m"}},{"v":2.43,"d":"2.43 m"},{"$f":"BI57-(BI57-BK57)*(BJ$56-BI$56)/(BK$56-BI$56)","v":{"v":3.530000000000001,"d":"3.53 m"}},{"v":2.33,"d":"2.33 m"},null,"3c) Verglasung",{"$f":"BN2","v":{"v":1,"d":"1.000"}},{"$nulls":4},"26101",{"$f":"BV57+(BX57-BZ57)","v":{"v":5.45,"d":"5.45 m"}},{"$f":"BT57-(BT57-BV57)*(BU$56-BT$56)/(BV$56-BT$56)","v":{"v":6.37,"d":"6.37 m"}},{"$f":"BX57+(BX57-BZ57)","v":{"v":4.99,"d":"4.99 m"}},{"$f":"BV57-(BV57-BX57)*(BW$56-BV$56)/(BX$56-BV$56)","v":{"v":6.37,"d":"6.37 m"}},{"v":4.53,"d":"4.53 m"},{"$f":"BX57-(BX57-BZ57)*(BY$56-BX$56)/(BZ$56-BX$56)","v":{"v":6.37,"d":"6.37 m"}},{"v":4.07,"d":"4.07 m"},{"$f":"BZ57-(BZ57-CB57)*(CA$56-BZ$56)/(CB$56-BZ$56)","v":{"v":5.82,"d":"5.82 m"}},{"v":3.72,"d":"3.72 m"},{"$f":"CB57-(CB57-CD57)*(CC$56-CB$56)/(CD$56-CB$56)","v":{"v":5.34,"d":"5.34 m"}},{"v":3.45,"d":"3.45 m"},{"$f":"CD57-(CD57-CF57)*(CE$56-CD$56)/(CF$56-CD$56)","v":{"v":4.990000000000002,"d":"4.99 m"}},{"v":3.23,"d":"3.23 m"},{"$f":"CF57-(CF57-CH57)*(CG$56-CF$56)/(CH$56-CF$56)","v":{"v":4.670000000000002,"d":"4.67 m"}},{"v":3.05,"d":"3.05 m"},{"$f":"CH57-(CH57-CJ57)*(CI$56-CH$56)/(CJ$56-CH$56)","v":{"v":4.489999999999997,"d":"4.49 m"}},{"v":2.89,"d":"2.89 m"},{"$f":"CJ57-(CJ57-CL57)*(CK$56-CJ$56)/(CL$56-CJ$56)","v":{"v":4.190000000000003,"d":"4.19 m"}},{"v":2.76,"d":"2.76 m"},{"$f":"CL57-(CL57-CN57)*(CM$56-CL$56)/(CN$56-CL$56)","v":{"v":4.0799999999999965,"d":"4.08 m"}},{"v":2.64,"d":"2.64 m"}]
[{"$nulls":6},"3a) Erhöhungsfaktor ke aufgrund x-Feldbalken",{"$f":"VLOOKUP($B$32,Daten!$A$104:$B$110,2)","v":{"v":1.34,"d":"1.340"}},{"$nulls":4},"26101+100x20x3",{"v":4.78,"d":"4.78 m"},{"v":5.36,"d":"5.36 m"},{"v":4.49,"d":"4.49 m"},{"v":5.36,"d":"5.36 m"},{"v":4.2,"d":"4.20 m"},{"v":5.36,"d":"5.36 m"},{"v":3.91,"d":"3.91 m"},{"v":5.010000000000002,"d":"5.01 m"},{"v":3.69,"d":"3.69 m"},{"v":4.709999999999999,"d":"4.71 m"},{"v":3.52,"d":"3.52 m"},{"v":4.569999999999999,"d":"4.57 m"},{"v":3.37,"d":"3.37 m"},{"v":4.409999999999999,"d":"4.41 m"},{"v":3.24,"d":"3.24 m"},{"v":4.230000000000003,"d":"4.23 m"},{"v":3.13,"d":"3.13 m"},{"v":4.0299999999999985,"d":"4.03 m"},{"v":3.04,"d":"3.04 m"},{"v":4.0299999999999985,"d":"4.03 m"},{"v":2.95,"d":"2.95 m"},null,"3b) Schnee sDA ",{"$f":"AK3","v":0.974},{"$nulls":4},"26101+100x20x3",{"$f":"AS58+(AU58-AW58)","v":{"v":5.840000000000001,"d":"5.84 m"}},{"v":6.820000000000001,"d":"6.82 m"},{"$f":"AU58+(AU58-AW58)","v":{"v":5.3500000000000005,"d":"5.35 m"}},{"v":6.820000000000001,"d":"6.82 m"},{"v":4.86,"d":"4.86 m"},{"v":6.820000000000001,"d":"6.82 m"},{"v":4.37,"d":"4.37 m"},{"v":6.220000000000001,"d":"6.22 m"},{"v":4,"d":"4.00 m"},{"v":5.679999999999999,"d":"5.68 m"},{"v":3.72,"d":"3.72 m"},{"v":5.400000000000002,"d":"5.40 m"},{"v":3.48,"d":"3.48 m"},{"v":5,"d":"5.00 m"},{"v":3.29,"d":"3.29 m"},{"v":4.819999999999999,"d":"4.82 m"},{"v":3.12,"d":"3.12 m"},{"v":4.520000000000001,"d":"4.52 m"},{"v":2.98,"d":"2.98 m"},{"v":4.300000000000001,"d":"4.30 m"},{"v":2.86,"d":"2.86 m"},null,"3c) außergewöhnliche Schneelast sa",{"$f":"BN3","v":{"v":10000,"d":"10000.000"}},{"$nulls":4},"26101+100x20x3",{"v":6.639999999999999,"d":"6.64 m"},{"v":7.759999999999998,"d":"7.76 m"},{"$f":"BX58+(BX58-BZ58)","v":{"v":6.079999999999999,"d":"6.08 m"}},{"v":7.759999999999998,"d":"7.76 m"},{"v":5.52,"d":"5.52 m"},{"v":7.759999999999998,"d":"7.76 m"},{"v":4.96,"d":"4.96 m"},{"v":7.06,"d":"7.06 m"},{"v":4.54,"d":"4.54 m"},{"v":6.460000000000002,"d":"6.46 m"},{"v":4.22,"d":"4.22 m"},{"v":6.109999999999997,"d":"6.11 m"},{"v":3.95,"d":"3.95 m"},{"v":5.710000000000002,"d":"5.71 m"},{"v":3.73,"d":"3.73 m"},{"v":5.4399999999999995,"d":"5.44 m"},{"v":3.54,"d":"3.54 m"},{"v":5.1400000000000015,"d":"5.14 m"},{"v":3.38,"d":"3.38 m"},{"v":4.919999999999996,"d":"4.92 m"},{"v":3.24,"d":"3.24 m"}]
[{"$nulls":12},"541516",{"$f":"P59+(R59-T59)","v":{"v":9.540000000000001,"d":"9.54 m"}},{"v":10.680000000000001,"d":"10.68 m"},{"$f":"R59+(R59-T59)","v":{"v":8.97,"d":"8.97 m"}},{"v":10.680000000000001,"d":"10.68 m"},{"v":8.4,"d":"8.40 m"},{"v":10.680000000000001,"d":"10.68 m"},{"v":7.83,"d":"7.83 m"},{"v":10.030000000000001,"d":"10.03 m"},{"v":7.39,"d":"7.39 m"},{"v":9.549999999999997,"d":"9.55 m"},{"v":7.03,"d":"7.03 m"},{"v":9.06,"d":"9.06 m"},{"v":6.74,"d":"6.74 m"},{"v":9.06,"d":"9.06 m"},{"v":6.45,"d":"6.45 m"},{"v":8.160000000000004,"d":"8.16 m"},{"v":6.26,"d":"6.26 m"},{"v":8.159999999999995,"d":"8.16 m"},{"v":6.07,"d":"6.07 m"},{"v":8.050000000000008,"d":"8.05 m"},{"v":5.89,"d":"5.89 m"},null,"3b) Wind",{"$f":"AK4","v":{"v":1,"d":"1.000"}},{"$nulls":4},"541516",{"$f":"AS59+(AU59-AW59)","v":{"v":9.540000000000001,"d":"9.54 m"}},{"v":10.680000000000001,"d":"10.68 m"},{"$f":"AU59+(AU59-AW59)","v":{"v":8.97,"d":"8.97 m"}},{"v":10.680000000000001,"d":"10.68 m"},{"v":8.4,"d":"8.40 m"},{"v":10.680000000000001,"d":"10.68 m"},{"v":7.83,"d":"7.83 m"},{"v":10.030000000000001,"d":"10.03 m"},{"v":7.39,"d":"7.39 m"},{"v":9.549999999999997,"d":"9.55 m"},{"v":7.03,"d":"7.03 m"},{"v":9.06,"d":"9.06 m"},{"v":6.74,"d":"6.74 m"},{"v":9.06,"d":"9.06 m"},{"v":6.45,"d":"6.45 m"},{"v":8.160000000000004,"d":"8.16 m"},{"v":6.26,"d":"6.26 m"},{"v":8.159999999999995,"d":"8.16 m"},{"v":6.07,"d":"6.07 m"},{"v":8.050000000000008,"d":"8.05 m"},{"v":5.89,"d":"5.89 m"},null,"3c) Wind",{"$f":"BN4","v":{"v":1,"d":"1.000"}},{"$nulls":4},"541516",{"$f":"BV59+(BX59-BZ59)","v":{"v":9.540000000000001,"d":"9.54 m"}},{"v":10.680000000000001,"d":"10.68 m"},{"$f":"BX59+(BX59-BZ59)","v":{"v":8.97,"d":"8.97 m"}},{"v":10.680000000000001,"d":"10.68 m"},{"v":8.4,"d":"8.40 m"},{"v":10.680000000000001,"d":"10.68 m"},{"v":7.83,"d":"7.83 m"},{"v":10.030000000000001,"d":"10.03 m"},{"v":7.39,"d":"7.39 m"},{"v":9.549999999999997,"d":"9.55 m"},{"v":7.03,"d":"7.03 m"},{"v":9.06,"d":"9.06 m"},{"v":6.74,"d":"6.74 m"},{"v":9.06,"d":"9.06 m"},{"v":6.45,"d":"6.45 m"},{"v":8.160000000000004,"d":"8.16 m"},{"v":6.26,"d":"6.26 m"},{"v":8.159999999999995,"d":"8.16 m"},{"v":6.07,"d":"6.07 m"},{"v":8.050000000000008,"d":"8.05 m"},{"v":5.89,"d":"5.89 m"}]
[{"$nulls":6},"3a) Tabellenwert b",{"$f":"O69","v":{"v":7.03,"d":"7.03 m"}},{"$nulls":4},"545445",{"v":5.340000000000001,"d":"5.34 m"},{"v":5.980000000000001,"d":"5.98 m"},{"v":5.0200000000000005,"d":"5.02 m"},{"v":5.980000000000001,"d":"5.98 m"},{"v":4.7,"d":"4.70 m"},{"v":5.980000000000001,"d":"5.98 m"},{"v":4.38,"d":"4.38 m"},{"v":5.63,"d":"5.63 m"},{"v":4.13,"d":"4.13 m"},{"v":5.329999999999998,"d":"5.33 m"},{"v":3.93,"d":"3.93 m"},{"v":5.120000000000003,"d":"5.12 m"},{"v":3.76,"d":"3.76 m"},{"v":4.879999999999997,"d":"4.88 m"},{"v":3.62,"d":"3.62 m"},{"v":4.700000000000001,"d":"4.70 m"},{"v":3.5,"d":"3.50 m"},{"v":4.599999999999999,"d":"4.60 m"},{"v":3.39,"d":"3.39 m"},{"v":4.490000000000001,"d":"4.49 m"},{"v":3.29,"d":"3.29 m"},null,"3b) Dachneigung",{"$f":"H54","v":{"v":1,"d":"1.000"}},{"$nulls":4},"545445",{"v":6.710000000000001,"d":"6.71 m"},{"v":7.850000000000001,"d":"7.85 m"},{"v":6.140000000000001,"d":"6.14 m"},{"v":7.850000000000001,"d":"7.85 m"},{"v":5.57,"d":"5.57 m"},{"v":7.850000000000001,"d":"7.85 m"},{"v":5,"d":"5.00 m"},{"v":7.1,"d":"7.10 m"},{"v":4.58,"d":"4.58 m"},{"v":6.619999999999999,"d":"6.62 m"},{"v":4.24,"d":"4.24 m"},{"v":6.060000000000002,"d":"6.06 m"},{"v":3.98,"d":"3.98 m"},{"v":5.82,"d":"5.82 m"},{"v":3.75,"d":"3.75 m"},{"v":5.459999999999999,"d":"5.46 m"},{"v":3.56,"d":"3.56 m"},{"v":5.160000000000002,"d":"5.16 m"},{"v":3.4,"d":"3.40 m"},{"v":4.940000000000001,"d":"4.94 m"},{"v":3.26,"d":"3.26 m"},null,"3c) Dachneigung",{"$f":"H54","v":{"v":1,"d":"1.000"}},{"$nulls":4},"545445",{"v":7.620000000000001,"d":"7.62 m"},{"v":8.920000000000002,"d":"8.92 m"},{"v":6.970000000000001,"d":"6.97 m"},{"v":8.920000000000002,"d":"8.92 m"},{"v":6.32,"d":"6.32 m"},{"v":8.920000000000002,"d":"8.92 m"},{"v":5.67,"d":"5.67 m"},{"v":8.069999999999997,"d":"8.07 m"},{"v":5.19,"d":"5.19 m"},{"v":7.410000000000001,"d":"7.41 m"},{"v":4.82,"d":"4.82 m"},{"v":6.990000000000004,"d":"6.99 m"},{"v":4.51,"d":"4.51 m"},{"v":6.51,"d":"6.51 m"},{"v":4.26,"d":"4.26 m"},{"v":6.2399999999999975,"d":"6.24 m"},{"v":4.04,"d":"4.04 m"},{"v":5.840000000000002,"d":"5.84 m"},{"v":3.86,"d":"3.86 m"},{"v":5.729999999999999,"d":"5.73 m"},{"v":3.69,"d":"3.69 m"}]
[{"$nulls":6},"3a) Korrigierter bzul",{"$f":"H60*H51*H52*H53*H54*H55*H56","v":{"v":6.4202178000000005,"d":"6.42 m"}},{"$nulls":4},"545445+120x50x3",{"v":6.37,"d":"6.37 m"},{"v":7.11,"d":"7.11 m"},{"v":6,"d":"6.00 m"},{"v":7.11,"d":"7.11 m"},{"v":5.63,"d":"5.63 m"},{"v":7.11,"d":"7.11 m"},{"v":5.26,"d":"5.26 m"},{"v":6.759999999999999,"d":"6.76 m"},{"v":4.96,"d":"4.96 m"},{"v":6.339999999999997,"d":"6.34 m"},{"v":4.73,"d":"4.73 m"},{"v":6.130000000000002,"d":"6.13 m"},{"v":4.53,"d":"4.53 m"},{"v":5.89,"d":"5.89 m"},{"v":4.36,"d":"4.36 m"},{"v":5.620000000000005,"d":"5.62 m"},{"v":4.22,"d":"4.22 m"},{"v":5.519999999999999,"d":"5.52 m"},{"v":4.09,"d":"4.09 m"},{"v":5.299999999999999,"d":"5.30 m"},{"v":3.98,"d":"3.98 m"},null,"3b) Faktor Trägergewicht",{"$f":"IF(AND($D$12<0.8,OR($D$11=$M$2,$D$11=$M$6,$D$11=$M$8,$D$11=$M$13)),0.99,IF(AND($D$12>=0.8,OR($D$11=$M$3,$D$11=$M$7,$D$11=$M$9,$D$11=$M$14,$D$11=$M$15)),0.96,IF(AND($D$12<0.8,OR($D$11=$M$3,$D$11=$M$7,$D$11=$M$9,$D$11=$M$14,$D$11=$M$15)),0.93,1)))","v":{"v":1,"d":"1.000"}},{"$nulls":4},"545445+120x50x3",{"v":8.27,"d":"8.27 m"},{"v":9.65,"d":"9.65 m"},{"v":7.579999999999999,"d":"7.58 m"},{"v":9.649999999999999,"d":"9.65 m"},{"v":6.89,"d":"6.89 m"},{"v":9.649999999999999,"d":"9.65 m"},{"v":6.2,"d":"6.20 m"},{"v":8.75,"d":"8.75 m"},{"v":5.69,"d":"5.69 m"},{"v":8.090000000000003,"d":"8.09 m"},{"v":5.29,"d":"5.29 m"},{"v":7.6000000000000005,"d":"7.60 m"},{"v":4.96,"d":"4.96 m"},{"v":7.1199999999999966,"d":"7.12 m"},{"v":4.69,"d":"4.69 m"},{"v":6.760000000000004,"d":"6.76 m"},{"v":4.46,"d":"4.46 m"},{"v":6.56,"d":"6.56 m"},{"v":4.25,"d":"4.25 m"},{"v":6.119999999999999,"d":"6.12 m"},{"v":4.08,"d":"4.08 m"},null,"3c) Faktor Trägergewicht",{"$f":"IF(AND($D$12<0.8,OR($D$26=$M$57,$D$26=$M$60)),0.99,IF(AND($D$12>=0.8,OR($D$26=$M$58,$D$26=$M$62,$D$26=$M$61,$D$26=$M$64,$D$26=$M$63)),0.96,IF(AND($D$12<0.8,OR($D$26=$M$58,$D$26=$M$62,$D$26=$M$61,$D$26=$M$63,$D$26=$M$64)),0.93,1)))","v":{"v":1,"d":"1.000"}},{"$nulls":4},"545445+120x50x3",{"v":9.36,"d":"9.36 m"},{"v":10.899999999999999,"d":"10.90 m"},{"v":8.59,"d":"8.59 m"},{"v":10.899999999999999,"d":"10.90 m"},{"v":7.82,"d":"7.82 m"},{"v":10.900000000000002,"d":"10.90 m"},{"v":7.05,"d":"7.05 m"},{"v":10,"d":"10.00 m"},{"v":6.46,"d":"6.46 m"},{"v":9.16,"d":"9.16 m"},{"v":6.01,"d":"6.01 m"},{"v":8.669999999999998,"d":"8.67 m"},{"v":5.63,"d":"5.63 m"},{"v":8.109999999999996,"d":"8.11 m"},{"v":5.32,"d":"5.32 m"},{"v":7.660000000000006,"d":"7.66 m"},{"v":5.06,"d":"5.06 m"},{"v":7.359999999999995,"d":"7.36 m"},{"v":4.83,"d":"4.83 m"},{"v":7.030000000000002,"d":"7.03 m"},{"v":4.63,"d":"4.63 m"}]
[{"$nulls":12},"545445+120x50x5",{"v":6.709999999999999,"d":"6.71 m"},{"v":7.489999999999998,"d":"7.49 m"},{"v":6.319999999999999,"d":"6.32 m"},{"v":7.489999999999998,"d":"7.49 m"},{"v":5.93,"d":"5.93 m"},{"v":7.489999999999998,"d":"7.49 m"},{"v":5.54,"d":"5.54 m"},{"v":7.039999999999999,"d":"7.04 m"},{"v":5.24,"d":"5.24 m"},{"v":6.6800000000000015,"d":"6.68 m"},{"v":5,"d":"5.00 m"},{"v":6.47,"d":"6.47 m"},{"v":4.79,"d":"4.79 m"},{"v":6.1499999999999995,"d":"6.15 m"},{"v":4.62,"d":"4.62 m"},{"v":5.970000000000003,"d":"5.97 m"},{"v":4.47,"d":"4.47 m"},{"v":5.8699999999999966,"d":"5.87 m"},{"v":4.33,"d":"4.33 m"},{"v":5.650000000000001,"d":"5.65 m"},{"v":4.21,"d":"4.21 m"},null,"3b) zul. Durchbiegung",{"$f":"VLOOKUP($D$27,Daten!$A$44:$B$47,2)","v":{"v":0.93,"d":"0.930"}},{"$nulls":4},"545445+120x50x5",{"v":8.899999999999999,"d":"8.90 m"},{"v":10.339999999999996,"d":"10.34 m"},{"v":8.18,"d":"8.18 m"},{"v":10.34,"d":"10.34 m"},{"v":7.46,"d":"7.46 m"},{"v":10.34,"d":"10.34 m"},{"v":6.74,"d":"6.74 m"},{"v":9.489999999999998,"d":"9.49 m"},{"v":6.19,"d":"6.19 m"},{"v":8.770000000000003,"d":"8.77 m"},{"v":5.76,"d":"5.76 m"},{"v":8.209999999999997,"d":"8.21 m"},{"v":5.41,"d":"5.41 m"},{"v":7.809999999999999,"d":"7.81 m"},{"v":5.11,"d":"5.11 m"},{"v":7.36,"d":"7.36 m"},{"v":4.86,"d":"4.86 m"},{"v":7.060000000000007,"d":"7.06 m"},{"v":4.64,"d":"4.64 m"},{"v":6.729999999999994,"d":"6.73 m"},{"v":4.45,"d":"4.45 m"},null,"3c) zul. Durchbiegung",{"$f":"VLOOKUP($D$27,Daten!$A$44:$B$47,2)","v":{"v":0.93,"d":"0.930"}},{"$nulls":4},"545445+120x50x5",{"v":10.14,"d":"10.14 m"},{"v":11.8,"d":"11.80 m"},{"v":9.31,"d":"9.31 m"},{"v":11.8,"d":"11.80 m"},{"v":8.48,"d":"8.48 m"},{"v":11.8,"d":"11.80 m"},{"v":7.65,"d":"7.65 m"},{"v":10.75,"d":"10.75 m"},{"v":7.03,"d":"7.03 m"},{"v":9.970000000000002,"d":"9.97 m"},{"v":6.54,"d":"6.54 m"},{"v":9.340000000000003,"d":"9.34 m"},{"v":6.14,"d":"6.14 m"},{"v":8.86,"d":"8.86 m"},{"v":5.8,"d":"5.80 m"},{"v":8.320000000000002,"d":"8.32 m"},{"v":5.52,"d":"5.52 m"},{"v":8.02,"d":"8.02 m"},{"v":5.27,"d":"5.27 m"},{"v":7.579999999999999,"d":"7.58 m"},{"v":5.06,"d":"5.06 m"}]
[{"$nulls":12},"545445+I120",{"v":7.089999999999998,"d":"7.09 m"},{"v":7.909999999999997,"d":"7.91 m"},{"v":6.679999999999999,"d":"6.68 m"},{"v":7.909999999999997,"d":"7.91 m"},{"v":6.27,"d":"6.27 m"},{"v":7.909999999999997,"d":"7.91 m"},{"v":5.86,"d":"5.86 m"},{"v":7.460000000000002,"d":"7.46 m"},{"v":5.54,"d":"5.54 m"},{"v":7.099999999999999,"d":"7.10 m"},{"v":5.28,"d":"5.28 m"},{"v":6.75,"d":"6.75 m"},{"v":5.07,"d":"5.07 m"},{"v":6.590000000000003,"d":"6.59 m"},{"v":4.88,"d":"4.88 m"},{"v":6.320000000000001,"d":"6.32 m"},{"v":4.72,"d":"4.72 m"},{"v":6.1199999999999966,"d":"6.12 m"},{"v":4.58,"d":"4.58 m"},{"v":6.009999999999999,"d":"6.01 m"},{"v":4.45,"d":"4.45 m"},{"$nulls":7},"545445+I120",{"v":9.699999999999998,"d":"9.70 m"},{"v":11.279999999999996,"d":"11.28 m"},{"v":8.909999999999998,"d":"8.91 m"},{"v":11.279999999999996,"d":"11.28 m"},{"v":8.12,"d":"8.12 m"},{"v":11.279999999999996,"d":"11.28 m"},{"v":7.33,"d":"7.33 m"},{"v":10.329999999999998,"d":"10.33 m"},{"v":6.73,"d":"6.73 m"},{"v":9.550000000000004,"d":"9.55 m"},{"v":6.26,"d":"6.26 m"},{"v":8.919999999999998,"d":"8.92 m"},{"v":5.88,"d":"5.88 m"},{"v":8.440000000000001,"d":"8.44 m"},{"v":5.56,"d":"5.56 m"},{"v":8.079999999999995,"d":"8.08 m"},{"v":5.28,"d":"5.28 m"},{"v":7.5800000000000045,"d":"7.58 m"},{"v":5.05,"d":"5.05 m"},{"v":7.359999999999999,"d":"7.36 m"},{"v":4.84,"d":"4.84 m"},{"$nulls":7},"545445+I120",{"v":11.000000000000002,"d":"11.00 m"},{"v":12.780000000000003,"d":"12.78 m"},{"v":10.110000000000001,"d":"10.11 m"},{"v":12.780000000000003,"d":"12.78 m"},{"v":9.22,"d":"9.22 m"},{"v":12.780000000000003,"d":"12.78 m"},{"v":8.33,"d":"8.33 m"},{"v":11.729999999999999,"d":"11.73 m"},{"v":7.65,"d":"7.65 m"},{"v":10.89,"d":"10.89 m"},{"v":7.11,"d":"7.11 m"},{"v":10.190000000000003,"d":"10.19 m"},{"v":6.67,"d":"6.67 m"},{"v":9.550000000000002,"d":"9.55 m"},{"v":6.31,"d":"6.31 m"},{"v":9.099999999999996,"d":"9.10 m"},{"v":6,"d":"6.00 m"},{"v":8.699999999999996,"d":"8.70 m"},{"v":5.73,"d":"5.73 m"},{"v":8.370000000000003,"d":"8.37 m"},{"v":5.49,"d":"5.49 m"}]
[{"$nulls":12},"545445+I120+2*100*10",{"v":7.49,"d":"7.49 m"},{"v":8.31,"d":"8.31 m"},{"v":7.08,"d":"7.08 m"},{"v":8.31,"d":"8.31 m"},{"v":6.67,"d":"6.67 m"},{"v":8.31,"d":"8.31 m"},{"v":6.26,"d":"6.26 m"},{"v":7.859999999999997,"d":"7.86 m"},{"v":5.94,"d":"5.94 m"},{"v":7.500000000000004,"d":"7.50 m"},{"v":5.68,"d":"5.68 m"},{"v":7.219999999999998,"d":"7.22 m"},{"v":5.46,"d":"5.46 m"},{"v":7.060000000000001,"d":"7.06 m"},{"v":5.26,"d":"5.26 m"},{"v":6.700000000000001,"d":"6.70 m"},{"v":5.1,"d":"5.10 m"},{"v":6.599999999999994,"d":"6.60 m"},{"v":4.95,"d":"4.95 m"},{"v":6.379999999999999,"d":"6.38 m"},{"v":4.82,"d":"4.82 m"},{"$nulls":7},"545445+I120+2*100*10",{"v":10.870000000000001,"d":"10.87 m"},{"v":12.530000000000001,"d":"12.53 m"},{"v":10.040000000000001,"d":"10.04 m"},{"v":12.530000000000001,"d":"12.53 m"},{"v":9.21,"d":"9.21 m"},{"v":12.530000000000001,"d":"12.53 m"},{"v":8.38,"d":"8.38 m"},{"v":11.630000000000003,"d":"11.63 m"},{"v":7.73,"d":"7.73 m"},{"v":10.790000000000004,"d":"10.79 m"},{"v":7.22,"d":"7.22 m"},{"v":10.16,"d":"10.16 m"},{"v":6.8,"d":"6.80 m"},{"v":9.679999999999996,"d":"9.68 m"},{"v":6.44,"d":"6.44 m"},{"v":9.230000000000004,"d":"9.23 m"},{"v":6.13,"d":"6.13 m"},{"v":8.729999999999997,"d":"8.73 m"},{"v":5.87,"d":"5.87 m"},{"v":8.510000000000002,"d":"8.51 m"},{"v":5.63,"d":"5.63 m"},{"$nulls":7},"545445+I120+2*100*10",{"v":12.380000000000003,"d":"12.38 m"},{"v":14.280000000000005,"d":"14.28 m"},{"v":11.430000000000001,"d":"11.43 m"},{"v":14.280000000000005,"d":"14.28 m"},{"v":10.48,"d":"10.48 m"},{"v":14.280000000000005,"d":"14.28 m"},{"v":9.53,"d":"9.53 m"},{"v":13.23,"d":"13.23 m"},{"v":8.79,"d":"8.79 m"},{"v":12.269999999999989,"d":"12.27 m"},{"v":8.21,"d":"8.21 m"},{"v":11.640000000000008,"d":"11.64 m"},{"v":7.72,"d":"7.72 m"},{"v":10.919999999999995,"d":"10.92 m"},{"v":7.32,"d":"7.32 m"},{"v":10.470000000000006,"d":"10.47 m"},{"v":6.97,"d":"6.97 m"},{"v":10.069999999999997,"d":"10.07 m"},{"v":6.66,"d":"6.66 m"},{"v":9.519999999999998,"d":"9.52 m"},{"v":6.4,"d":"6.40 m"}]
[{"$nulls":6},"4a) Korrekturfaktoren Unterzug",{"$nulls":5},"545446",{"$f":"P65+(R65-T65)","v":{"v":4.2,"d":"4.20 m"}},{"$f":"N65-(N65-P65)*(O$56-N$56)/(P$56-N$56)","v":{"v":4.7,"d":"4.70 m"}},{"$f":"R65+(R65-T65)","v":{"v":3.95,"d":"3.95 m"}},{"$f":"P65-(P65-R65)*(Q$56-P$56)/(R$56-P$56)","v":{"v":4.7,"d":"4.70 m"}},{"v":3.7,"d":"3.70 m"},{"$f":"R65-(R65-T65)*(S$56-R$56)/(T$56-R$56)","v":{"v":4.7,"d":"4.70 m"}},{"v":3.45,"d":"3.45 m"},{"$f":"T65-(T65-V65)*(U$56-T$56)/(V$56-T$56)","v":{"v":4.450000000000001,"d":"4.45 m"}},{"v":3.25,"d":"3.25 m"},{"$f":"V65-(V65-X65)*(W$56-V$56)/(X$56-V$56)","v":{"v":4.210000000000001,"d":"4.21 m"}},{"v":3.09,"d":"3.09 m"},{"$f":"X65-(X65-Z65)*(Y$56-X$56)/(Z$56-X$56)","v":{"v":3.999999999999999,"d":"4.00 m"}},{"v":2.96,"d":"2.96 m"},{"$f":"Z65-(Z65-AB65)*(AA$56-Z$56)/(AB$56-Z$56)","v":{"v":3.920000000000001,"d":"3.92 m"}},{"v":2.84,"d":"2.84 m"},{"$f":"AB65-(AB65-AD65)*(AC$56-AB$56)/(AD$56-AB$56)","v":{"v":3.6499999999999986,"d":"3.65 m"}},{"v":2.75,"d":"2.75 m"},{"$f":"AD65-(AD65-AF65)*(AE$56-AD$56)/(AF$56-AD$56)","v":{"v":3.6499999999999986,"d":"3.65 m"}},{"v":2.66,"d":"2.66 m"},{"$f":"AF65-(AF65-AH65)*(AG$56-AF$56)/(AH$56-AF$56)","v":{"v":3.4300000000000033,"d":"3.43 m"}},{"v":2.59,"d":"2.59 m"},null,"3b) Tabellenwert b",{"$f":"AR69","v":{"v":7.03,"d":"7.03 m"}},{"$nulls":4},"545446",{"$f":"AS65+(AU65-AW65)","v":{"v":5.360000000000001,"d":"5.36 m"}},{"$f":"AQ65-(AQ65-AS65)*(AR$56-AQ$56)/(AS$56-AQ$56)","v":{"v":6.280000000000003,"d":"6.28 m"}},{"$f":"AU65+(AU65-AW65)","v":{"v":4.9,"d":"4.90 m"}},{"$f":"AS65-(AS65-AU65)*(AT$56-AS$56)/(AU$56-AS$56)","v":{"v":6.28,"d":"6.28 m"}},{"v":4.44,"d":"4.44 m"},{"$f":"AU65-(AU65-AW65)*(AV$56-AU$56)/(AW$56-AU$56)","v":{"v":6.280000000000002,"d":"6.28 m"}},{"v":3.98,"d":"3.98 m"},{"$f":"AW65-(AW65-AY65)*(AX$56-AW$56)/(AY$56-AW$56)","v":{"v":5.68,"d":"5.68 m"}},{"v":3.64,"d":"3.64 m"},{"$f":"AY65-(AY65-BA65)*(AZ$56-AY$56)/(BA$56-AY$56)","v":{"v":5.200000000000001,"d":"5.20 m"}},{"v":3.38,"d":"3.38 m"},{"$f":"BA65-(BA65-BC65)*(BB$56-BA$56)/(BC$56-BA$56)","v":{"v":4.919999999999998,"d":"4.92 m"}},{"v":3.16,"d":"3.16 m"},{"$f":"BC65-(BC65-BE65)*(BD$56-BC$56)/(BE$56-BC$56)","v":{"v":4.600000000000001,"d":"4.60 m"}},{"v":2.98,"d":"2.98 m"},{"$f":"BE65-(BE65-BG65)*(BF$56-BE$56)/(BG$56-BE$56)","v":{"v":4.329999999999999,"d":"4.33 m"}},{"v":2.83,"d":"2.83 m"},{"$f":"BG65-(BG65-BI65)*(BH$56-BG$56)/(BI$56-BG$56)","v":{"v":4.129999999999999,"d":"4.13 m"}},{"v":2.7,"d":"2.70 m"},{"$f":"BI65-(BI65-BK65)*(BJ$56-BI$56)/(BK$56-BI$56)","v":{"v":3.9100000000000037,"d":"3.91 m"}},{"v":2.59,"d":"2.59 m"},null,"3c) Tabellenwert b",{"$f":"BU69","v":{"v":7.03,"d":"7.03 m"}},{"$nulls":4},"545446",{"$f":"BV65+(BX65-BZ65)","v":{"v":6.080000000000001,"d":"6.08 m"}},{"$f":"BT65-(BT65-BV65)*(BU$56-BT$56)/(BV$56-BT$56)","v":{"v":7.120000000000002,"d":"7.12 m"}},{"$f":"BX65+(BX65-BZ65)","v":{"v":5.5600000000000005,"d":"5.56 m"}},{"$f":"BV65-(BV65-BX65)*(BW$56-BV$56)/(BX$56-BV$56)","v":{"v":7.120000000000002,"d":"7.12 m"}},{"v":5.04,"d":"5.04 m"},{"$f":"BX65-(BX65-BZ65)*(BY$56-BX$56)/(BZ$56-BX$56)","v":{"v":7.120000000000002,"d":"7.12 m"}},{"v":4.52,"d":"4.52 m"},{"$f":"BZ65-(BZ65-CB65)*(CA$56-BZ$56)/(CB$56-BZ$56)","v":{"v":6.469999999999998,"d":"6.47 m"}},{"v":4.13,"d":"4.13 m"},{"$f":"CB65-(CB65-CD65)*(CC$56-CB$56)/(CD$56-CB$56)","v":{"v":5.929999999999999,"d":"5.93 m"}},{"v":3.83,"d":"3.83 m"},{"$f":"CD65-(CD65-CF65)*(CE$56-CD$56)/(CF$56-CD$56)","v":{"v":5.510000000000002,"d":"5.51 m"}},{"v":3.59,"d":"3.59 m"},{"$f":"CF65-(CF65-CH65)*(CG$56-CF$56)/(CH$56-CF$56)","v":{"v":5.27,"d":"5.27 m"}},{"v":3.38,"d":"3.38 m"},{"$f":"CH65-(CH65-CJ65)*(CI$56-CH$56)/(CJ$56-CH$56)","v":{"v":4.909999999999999,"d":"4.91 m"}},{"v":3.21,"d":"3.21 m"},{"$f":"CJ65-(CJ65-CL65)*(CK$56-CJ$56)/(CL$56-CJ$56)","v":{"v":4.610000000000001,"d":"4.61 m"}},{"v":3.07,"d":"3.07 m"},{"$f":"CL65-(CL65-CN65)*(CM$56-CL$56)/(CN$56-CL$56)","v":{"v":4.499999999999998,"d":"4.50 m"}},{"v":2.94,"d":"2.94 m"}]
[{"$nulls":6},"4a) Verglasung",{"$f":"H2","v":{"v":1,"d":"1.000"}},{"$nulls":4},"545446+90x50x4",{"$f":"P66+(R66-T66)","v":{"v":5.240000000000001,"d":"5.24 m"}},{"v":5.860000000000002,"d":"5.86 m"},{"v":4.930000000000001,"d":"4.93 m"},{"v":5.860000000000002,"d":"5.86 m"},{"v":4.62,"d":"4.62 m"},{"v":5.860000000000002,"d":"5.86 m"},{"v":4.31,"d":"4.31 m"},{"v":5.509999999999996,"d":"5.51 m"},{"v":4.07,"d":"4.07 m"},{"v":5.210000000000003,"d":"5.21 m"},{"v":3.88,"d":"3.88 m"},{"v":5.069999999999999,"d":"5.07 m"},{"v":3.71,"d":"3.71 m"},{"v":4.749999999999999,"d":"4.75 m"},{"v":3.58,"d":"3.58 m"},{"v":4.660000000000001,"d":"4.66 m"},{"v":3.46,"d":"3.46 m"},{"v":4.559999999999999,"d":"4.56 m"},{"v":3.35,"d":"3.35 m"},{"v":4.340000000000003,"d":"4.34 m"},{"v":3.26,"d":"3.26 m"},null,"3b) Korrigierter bzul",{"$f":"AK65*AK57*AK58*AK59*AK60*AK61*AK62","v":{"v":6.367914600000001,"d":"6.37 m"}},{"$nulls":4},"545446+90x50x4",{"v":7.1,"d":"7.10 m"},{"v":8.28,"d":"8.28 m"},{"v":6.51,"d":"6.51 m"},{"v":8.28,"d":"8.28 m"},{"v":5.92,"d":"5.92 m"},{"v":8.28,"d":"8.28 m"},{"v":5.33,"d":"5.33 m"},{"v":7.530000000000002,"d":"7.53 m"},{"v":4.89,"d":"4.89 m"},{"v":6.9899999999999975,"d":"6.99 m"},{"v":4.54,"d":"4.54 m"},{"v":6.500000000000002,"d":"6.50 m"},{"v":4.26,"d":"4.26 m"},{"v":6.1800000000000015,"d":"6.18 m"},{"v":4.02,"d":"4.02 m"},{"v":5.819999999999997,"d":"5.82 m"},{"v":3.82,"d":"3.82 m"},{"v":5.52,"d":"5.52 m"},{"v":3.65,"d":"3.65 m"},{"v":5.299999999999999,"d":"5.30 m"},{"v":3.5,"d":"3.50 m"},null,"3c) Korrigierter bzul",{"$f":"BN65*BN57*BN58*BN59*BN60*BN61*BN62","v":{"v":65379,"d":"65,379.00 m"}},{"$nulls":4},"545446+90x50x4",{"v":8.059999999999999,"d":"8.06 m"},{"v":9.399999999999997,"d":"9.40 m"},{"v":7.39,"d":"7.39 m"},{"v":9.399999999999999,"d":"9.40 m"},{"v":6.72,"d":"6.72 m"},{"v":9.399999999999999,"d":"9.40 m"},{"v":6.05,"d":"6.05 m"},{"v":8.55,"d":"8.55 m"},{"v":5.55,"d":"5.55 m"},{"v":7.949999999999997,"d":"7.95 m"},{"v":5.15,"d":"5.15 m"},{"v":7.390000000000002,"d":"7.39 m"},{"v":4.83,"d":"4.83 m"},{"v":6.909999999999998,"d":"6.91 m"},{"v":4.57,"d":"4.57 m"},{"v":6.640000000000004,"d":"6.64 m"},{"v":4.34,"d":"4.34 m"},{"v":6.340000000000002,"d":"6.34 m"},{"v":4.14,"d":"4.14 m"},{"v":6.0099999999999945,"d":"6.01 m"},{"v":3.97,"d":"3.97 m"}]
[{"$nulls":6},"4a) Schnee sDA ",{"$f":"H3","v":0.982}]
[{"$nulls":6},"4a) Wind",{"$f":"H4","v":{"v":1,"d":"1.000"}},{"$nulls":4},"3a) Rinne","Tiefe","b",{"$nulls":26},"3b) Rinne","Tiefe","b",{"$nulls":26},"3c) Rinne","Tiefe","b"]
[{"$nulls":6},"4a) Dachneigung",{"$f":"H54","v":{"v":1,"d":"1.000"}},{"$nulls":4},{"$f":"IF(D26=\"\",\"\",MATCH(D26,M57:M67))","v":3},{"$f":"IF(D10=\"\",\"\",MATCH('Ermittlung Schneelast'!D19,N56:AH56,0))","v":11},{"$f":"IF(OR(D26=\"\",D25=\"\"),0,INDEX(N57:AH67,M69,N69))","v":{"v":7.03,"d":"7.03 m"}},{"$nulls":26},{"$f":"IF($D$26=\"\",\"\",MATCH($D$26,AP57:AP67))","v":3},{"$f":"IF($D$10=\"\",\"\",MATCH('Ermittlung Schneelast'!$D$19,AQ56:BK56,0))","v":11},{"$f":"IF(OR($D$25=\"\",$D$26=\"\"),0,INDEX(AQ57:BK67,AP69,AQ69))","v":{"v":7.03,"d":"7.03 m"}},{"$nulls":26},{"$f":"IF($D$26=\"\",\"\",MATCH($D$26,BS57:BS67))","v":3},{"$f":"IF($D$10=\"\",\"\",MATCH('Ermittlung Schneelast'!$D$19,BT56:CN56,0))","v":11},{"$f":"IF(OR($D$25=\"\",$D$26=\"\"),0,INDEX(BT57:CN67,BS69,BT69))","v":{"v":7.03,"d":"7.03 m"}}]
[{"$nulls":6},"4a) Faktor Trägergewicht",{"$f":"H55","v":{"v":1,"d":"1.000"}}]
[{"$nulls":6},"4a) zul. Durchbiegung",{"$f":"VLOOKUP($D$41,Daten!$A$44:$B$47,2)","v":{"v":0.93,"d":"0.930"}},{"$nulls":4},"4a) Unterzug",1,{"$f":"IF(AND(D38>1,D38<1.5),D38,0)","v":{"v":0,"d":"0.00 m"}},1.5,{"$f":"IF(AND(D38>1.5,D38<2),D38,0)","v":{"v":0,"d":"0.00 m"}},{"v":2,"d":"2.00 m"},{"$f":"IF(AND(D38>2,D38<2.5),D38,0)","v":{"v":0,"d":"0.00 m"}},{"v":2.5,"d":"2.50 m"},{"$f":"IF(AND(D38>2.5,D38<3),D38,0)","v":{"v":0,"d":"0.00 m"}},{"v":3,"d":"3.00 m"},{"$f":"IF(AND(D38>3,D38<3.5),D38,0)","v":{"v":0,"d":"0.00 m"}},{"v":3.5,"d":"3.50 m"},{"$f":"IF(AND(D38>3.5,D38<4),D38,0)","v":{"v":0,"d":"0.00 m"}},{"v":4,"d":"4.00 m"},{"$nulls":9},"4b) Korrekturfaktoren Unterzug",{"$nulls":5},"4b) Unterzug",{"v":1,"d":"1.00 m"},{"$f":"IF(AND(D38>1,D38<1.5),D38,0)","v":{"v":0,"d":"0.00 m"}},{"v":1.5,"d":"1.50 m"},{"$f":"IF(AND(D38>1.5,D38<2),D38,0)","v":{"v":0,"d":"0.00 m"}},{"v":2,"d":"2.00 m"},{"$f":"IF(AND(D38>2,D38<2.5),D38,0)","v":{"v":0,"d":"0.00 m"}},{"v":2.5,"d":"2.50 m"},{"$f":"IF(AND(D38>2.5,D38<3),D38,0)","v":{"v":0,"d":"0.00 m"}},{"v":3,"d":"3.00 m"},{"$f":"IF(AND(D38>3,D38<3.5),D38,0)","v":{"v":0,"d":"0.00 m"}},{"v":3.5,"d":"3.50 m"},{"$f":"IF(AND(D38>3.5,D38<4),D38,0)","v":{"v":0,"d":"0.00 m"}},{"v":4,"d":"4.00 m"},{"$nulls":9},"4c) Korrekturfaktoren Unterzug",{"$nulls":5},"4c) Unterzug",{"v":1,"d":"1.00 m"},{"$f":"IF(AND(D38>1,D38<1.5),D38,0)","v":{"v":0,"d":"0.00 m"}},{"v":1.5,"d":"1.50 m"},{"$f":"IF(AND(D38>1.5,D38<2),D38,0)","v":{"v":0,"d":"0.00 m"}},{"v":2,"d":"2.00 m"},{"$f":"IF(AND(D38>2,D38<2.5),D38,0)","v":{"v":0,"d":"0.00 m"}},{"v":2.5,"d":"2.50 m"},{"$f":"IF(AND(D38>2.5,D38<3),D38,0)","v":{"v":0,"d":"0.00 m"}},{"v":3,"d":"3.00 m"},{"$f":"IF(AND(D38>3,D38<3.5),D38,0)","v":{"v":0,"d":"0.00 m"}},{"v":3.5,"d":"3.50 m"},{"$f":"IF(AND(D38>3.5,D38<4),D38,0)","v":{"v":0,"d":"0.00 m"}},{"v":4,"d":"4.00 m"}]
[{"$nulls":12},"541492",{"v":5.03,"d":"5.03 m"},{"$f":"N72-(N72-P72)*(O$71-N$71)/(P$71-N$71)","v":{"v":6.2700000000000005,"d":"6.27 m"}},{"v":4.41,"d":"4.41 m"},{"$f":"P72-(P72-R72)*(Q$71-P$71)/(R$71-P$71)","v":{"v":5.55,"d":"5.55 m"}},{"v":4.03,"d":"4.03 m"},{"$f":"R72-(R72-T72)*(S$71-R$71)/(T$71-R$71)","v":{"v":5.230000000000001,"d":"5.23 m"}},{"v":3.73,"d":"3.73 m"},{"$f":"T72-(T72-V72)*(U$71-T$71)/(V$71-T$71)","v":{"v":4.830000000000001,"d":"4.83 m"}},{"v":3.51,"d":"3.51 m"},{"$f":"V72-(V72-X72)*(W$71-V$71)/(X$71-V$71)","v":{"v":4.529999999999999,"d":"4.53 m"}},{"v":3.34,"d":"3.34 m"},{"$f":"X72-(X72-Z72)*(Y$71-X$71)/(Z$71-X$71)","v":{"v":4.389999999999999,"d":"4.39 m"}},{"v":3.19,"d":"3.19 m"},{"$nulls":9},"4b) Verglasung",{"$f":"AK2","v":{"v":1,"d":"1.000"}},{"$nulls":4},"541492",{"v":5.96,"d":"5.96 m"},{"$f":"AQ72-(AQ72-AS72)*(AR$71-AQ$71)/(AS$71-AQ$71)","v":{"v":8.100000000000001,"d":"8.10 m"}},{"v":4.89,"d":"4.89 m"},{"$f":"AS72-(AS72-AU72)*(AT$71-AS$71)/(AU$71-AS$71)","v":{"v":6.809999999999999,"d":"6.81 m"}},{"v":4.25,"d":"4.25 m"},{"$f":"AU72-(AU72-AW72)*(AV$71-AU$71)/(AW$71-AU$71)","v":{"v":6.050000000000001,"d":"6.05 m"}},{"v":3.8,"d":"3.80 m"},{"$f":"AW72-(AW72-AY72)*(AX$71-AW$71)/(AY$71-AW$71)","v":{"v":5.399999999999999,"d":"5.40 m"}},{"v":3.48,"d":"3.48 m"},{"$f":"AY72-(AY72-BA72)*(AZ$71-AY$71)/(BA$71-AY$71)","v":{"v":5.039999999999999,"d":"5.04 m"}},{"v":3.22,"d":"3.22 m"},{"$f":"BA72-(BA72-BC72)*(BB$71-BA$71)/(BC$71-BA$71)","v":{"v":4.690000000000003,"d":"4.69 m"}},{"v":3.01,"d":"3.01 m"},{"$nulls":9},"4c) Verglasung",{"$f":"BN2","v":{"v":1,"d":"1.000"}},{"$nulls":4},"541492",{"v":6.77,"d":"6.77 m"},{"$f":"BT72-(BT72-BV72)*(BU$71-BT$71)/(BV$71-BT$71)","v":{"v":9.209999999999999,"d":"9.21 m"}},{"v":5.55,"d":"5.55 m"},{"$f":"BV72-(BV72-BX72)*(BW$71-BV$71)/(BX$71-BV$71)","v":{"v":7.739999999999998,"d":"7.74 m"}},{"v":4.82,"d":"4.82 m"},{"$f":"BX72-(BX72-BZ72)*(BY$71-BX$71)/(BZ$71-BX$71)","v":{"v":6.860000000000003,"d":"6.86 m"}},{"v":4.31,"d":"4.31 m"},{"$f":"BZ72-(BZ72-CB72)*(CA$71-BZ$71)/(CB$71-BZ$71)","v":{"v":6.159999999999998,"d":"6.16 m"}},{"v":3.94,"d":"3.94 m"},{"$f":"CB72-(CB72-CD72)*(CC$71-CB$71)/(CD$71-CB$71)","v":{"v":5.68,"d":"5.68 m"}},{"v":3.65,"d":"3.65 m"},{"$f":"CD72-(CD72-CF72)*(CE$71-CD$71)/(CF$71-CD$71)","v":{"v":5.26,"d":"5.26 m"}},{"v":3.42,"d":"3.42 m"}]
[{"$nulls":6},"4a) Erhöhungsfaktor ke aufgrund x-Feldbalken",{"$f":"VLOOKUP($B$46,Daten!$A$104:$B$110,2)","v":{"v":1,"d":"1.000"}},{"$nulls":4},"541492+160*80*4",{"v":7.32,"d":"7.32 m"},{"v":9,"d":"9.00 m"},{"v":6.48,"d":"6.48 m"},{"v":8.160000000000002,"d":"8.16 m"},{"v":5.92,"d":"5.92 m"},{"v":7.520000000000001,"d":"7.52 m"},{"v":5.52,"d":"5.52 m"},{"v":7.069999999999998,"d":"7.07 m"},{"v":5.21,"d":"5.21 m"},{"v":6.71,"d":"6.71 m"},{"v":4.96,"d":"4.96 m"},{"v":6.43,"d":"6.43 m"},{"v":4.75,"d":"4.75 m"},{"$nulls":9},"4b) Schnee sDA ",{"$f":"AK3","v":0.974},{"$nulls":4},"541492+160*80*4",{"v":8.86,"d":"8.86 m"},{"v":11.859999999999998,"d":"11.86 m"},{"v":7.36,"d":"7.36 m"},{"v":10.150000000000002,"d":"10.15 m"},{"v":6.43,"d":"6.43 m"},{"v":9.029999999999998,"d":"9.03 m"},{"v":5.78,"d":"5.78 m"},{"v":8.180000000000003,"d":"8.18 m"},{"v":5.3,"d":"5.30 m"},{"v":7.579999999999999,"d":"7.58 m"},{"v":4.92,"d":"4.92 m"},{"v":7.089999999999997,"d":"7.09 m"},{"v":4.61,"d":"4.61 m"},{"$nulls":9},"4c) Schnee sDA ",{"$f":"BN3","v":{"v":10000,"d":"10000.000"}},{"$nulls":4},"541492+160*80*4",{"v":10.07,"d":"10.07 m"},{"v":13.490000000000002,"d":"13.49 m"},{"v":8.36,"d":"8.36 m"},{"v":11.54,"d":"11.54 m"},{"v":7.3,"d":"7.30 m"},{"v":10.219999999999999,"d":"10.22 m"},{"v":6.57,"d":"6.57 m"},{"v":9.370000000000003,"d":"9.37 m"},{"v":6.01,"d":"6.01 m"},{"v":8.589999999999998,"d":"8.59 m"},{"v":5.58,"d":"5.58 m"},{"v":8.029999999999998,"d":"8.03 m"},{"v":5.23,"d":"5.23 m"}]
[{"$nulls":12},"541492+IPE160",{"v":7.96,"d":"7.96 m"},{"v":9.780000000000001,"d":"9.78 m"},{"v":7.05,"d":"7.05 m"},{"v":8.849999999999998,"d":"8.85 m"},{"v":6.45,"d":"6.45 m"},{"v":8.21,"d":"8.21 m"},{"v":6.01,"d":"6.01 m"},{"v":7.709999999999999,"d":"7.71 m"},{"v":5.67,"d":"5.67 m"},{"v":7.289999999999997,"d":"7.29 m"},{"v":5.4,"d":"5.40 m"},{"v":7.010000000000003,"d":"7.01 m"},{"v":5.17,"d":"5.17 m"},{"$nulls":9},"4b) Wind",{"$f":"AK4","v":{"v":1,"d":"1.000"}},{"$nulls":4},"541492+IPE160",{"v":10.07,"d":"10.07 m"},{"v":13.470000000000002,"d":"13.47 m"},{"v":8.37,"d":"8.37 m"},{"v":11.519999999999996,"d":"11.52 m"},{"v":7.32,"d":"7.32 m"},{"v":10.240000000000002,"d":"10.24 m"},{"v":6.59,"d":"6.59 m"},{"v":9.389999999999997,"d":"9.39 m"},{"v":6.03,"d":"6.03 m"},{"v":8.610000000000003,"d":"8.61 m"},{"v":5.6,"d":"5.60 m"},{"v":8.049999999999997,"d":"8.05 m"},{"v":5.25,"d":"5.25 m"},{"$nulls":9},"4c) Wind",{"$f":"BN4","v":{"v":1,"d":"1.000"}},{"$nulls":4},"541492+IPE160",{"v":11.45,"d":"11.45 m"},{"v":15.329999999999998,"d":"15.33 m"},{"v":9.51,"d":"9.51 m"},{"v":13.109999999999998,"d":"13.11 m"},{"v":8.31,"d":"8.31 m"},{"v":11.63,"d":"11.63 m"},{"v":7.48,"d":"7.48 m"},{"v":10.630000000000004,"d":"10.63 m"},{"v":6.85,"d":"6.85 m"},{"v":9.789999999999996,"d":"9.79 m"},{"v":6.36,"d":"6.36 m"},{"v":9.160000000000004,"d":"9.16 m"},{"v":5.96,"d":"5.96 m"}]
[{"$nulls":6},"4a) Tabellenwert b",{"$f":"O88","v":{"v":5.27,"d":"5.27 m"}},{"$nulls":4},"541493",{"v":3.36,"d":"3.36 m"},{"v":4.199999999999999,"d":"4.20 m"},{"v":2.94,"d":"2.94 m"},{"v":3.7199999999999993,"d":"3.72 m"},{"v":2.68,"d":"2.68 m"},{"v":3.44,"d":"3.44 m"},{"v":2.49,"d":"2.49 m"},{"v":3.240000000000002,"d":"3.24 m"},{"v":2.34,"d":"2.34 m"},{"v":3.059999999999998,"d":"3.06 m"},{"v":2.22,"d":"2.22 m"},{"v":2.8500000000000023,"d":"2.85 m"},{"v":2.13,"d":"2.13 m"},{"$nulls":9},"4b) Dachneigung",{"$f":"AK60","v":{"v":1,"d":"1.000"}},{"$nulls":4},"541493",{"v":3.9,"d":"3.90 m"},{"v":5.32,"d":"5.32 m"},{"v":3.19,"d":"3.19 m"},{"v":4.449999999999999,"d":"4.45 m"},{"v":2.77,"d":"2.77 m"},{"v":3.93,"d":"3.93 m"},{"v":2.48,"d":"2.48 m"},{"v":3.580000000000001,"d":"3.58 m"},{"v":2.26,"d":"2.26 m"},{"v":3.219999999999998,"d":"3.22 m"},{"v":2.1,"d":"2.10 m"},{"v":3.080000000000001,"d":"3.08 m"},{"v":1.96,"d":"1.96 m"},{"$nulls":9},"4c) Dachneigung",{"$f":"BN60","v":{"v":1,"d":"1.000"}},{"$nulls":4},"541493",{"v":4.42,"d":"4.42 m"},{"v":6.02,"d":"6.02 m"},{"v":3.62,"d":"3.62 m"},{"v":5.0600000000000005,"d":"5.06 m"},{"v":3.14,"d":"3.14 m"},{"v":4.460000000000001,"d":"4.46 m"},{"v":2.81,"d":"2.81 m"},{"v":4.010000000000002,"d":"4.01 m"},{"v":2.57,"d":"2.57 m"},{"v":3.7099999999999995,"d":"3.71 m"},{"v":2.38,"d":"2.38 m"},{"v":3.499999999999998,"d":"3.50 m"},{"v":2.22,"d":"2.22 m"}]
[{"$nulls":6},"4a) Korrigierter bzul",{"$f":"H75*H66*H67*H68*H69*H70*H71","v":{"v":4.8128802,"d":"4.81 m"}},{"$nulls":4},"541493+120*50*3",{"v":4.88,"d":"4.88 m"},{"v":6.04,"d":"6.04 m"},{"v":4.3,"d":"4.30 m"},{"v":5.4399999999999995,"d":"5.44 m"},{"v":3.92,"d":"3.92 m"},{"v":5.039999999999999,"d":"5.04 m"},{"v":3.64,"d":"3.64 m"},{"v":4.6899999999999995,"d":"4.69 m"},{"v":3.43,"d":"3.43 m"},{"v":4.390000000000001,"d":"4.39 m"},{"v":3.27,"d":"3.27 m"},{"v":4.250000000000001,"d":"4.25 m"},{"v":3.13,"d":"3.13 m"},{"$nulls":9},"4b) Faktor Trägergewicht",{"$f":"AK61","v":{"v":1,"d":"1.000"}},{"$nulls":4},"541493+120*50*3",{"v":5.55,"d":"5.55 m"},{"v":7.489999999999999,"d":"7.49 m"},{"v":4.58,"d":"4.58 m"},{"v":6.380000000000001,"d":"6.38 m"},{"v":3.98,"d":"3.98 m"},{"v":5.620000000000001,"d":"5.62 m"},{"v":3.57,"d":"3.57 m"},{"v":5.0699999999999985,"d":"5.07 m"},{"v":3.27,"d":"3.27 m"},{"v":4.710000000000001,"d":"4.71 m"},{"v":3.03,"d":"3.03 m"},{"v":4.359999999999999,"d":"4.36 m"},{"v":2.84,"d":"2.84 m"},{"$nulls":9},"4c) Faktor Trägergewicht",{"$f":"BN61","v":{"v":1,"d":"1.000"}},{"$nulls":4},"541493+120*50*3",{"v":6.3,"d":"6.30 m"},{"v":8.5,"d":"8.50 m"},{"v":5.2,"d":"5.20 m"},{"v":7.240000000000002,"d":"7.24 m"},{"v":4.52,"d":"4.52 m"},{"v":6.359999999999999,"d":"6.36 m"},{"v":4.06,"d":"4.06 m"},{"v":5.809999999999998,"d":"5.81 m"},{"v":3.71,"d":"3.71 m"},{"v":5.33,"d":"5.33 m"},{"v":3.44,"d":"3.44 m"},{"v":4.979999999999999,"d":"4.98 m"},{"v":3.22,"d":"3.22 m"}]
[{"$nulls":12},"541493+120*50*5",{"v":5.46,"d":"5.46 m"},{"v":6.739999999999999,"d":"6.74 m"},{"v":4.82,"d":"4.82 m"},{"v":6.08,"d":"6.08 m"},{"v":4.4,"d":"4.40 m"},{"v":5.600000000000003,"d":"5.60 m"},{"v":4.1,"d":"4.10 m"},{"v":5.299999999999999,"d":"5.30 m"},{"v":3.86,"d":"3.86 m"},{"v":4.939999999999998,"d":"4.94 m"},{"v":3.68,"d":"3.68 m"},{"v":4.800000000000001,"d":"4.80 m"},{"v":3.52,"d":"3.52 m"},{"$nulls":9},"4b) zul. Durchbiegung",{"$f":"VLOOKUP($D$41,Daten!$A$44:$B$47,2)","v":{"v":0.93,"d":"0.930"}},{"$nulls":4},"541493+120*50*5",{"v":6.58,"d":"6.58 m"},{"v":8.84,"d":"8.84 m"},{"v":5.45,"d":"5.45 m"},{"v":7.550000000000001,"d":"7.55 m"},{"v":4.75,"d":"4.75 m"},{"v":6.670000000000002,"d":"6.67 m"},{"v":4.27,"d":"4.27 m"},{"v":6.069999999999997,"d":"6.07 m"},{"v":3.91,"d":"3.91 m"},{"v":5.590000000000002,"d":"5.59 m"},{"v":3.63,"d":"3.63 m"},{"v":5.24,"d":"5.24 m"},{"v":3.4,"d":"3.40 m"},{"$nulls":9},"4c) zul. Durchbiegung",{"$f":"VLOOKUP($D$41,Daten!$A$44:$B$47,2)","v":{"v":0.93,"d":"0.930"}},{"$nulls":4},"541493+120*50*5",{"v":7.47,"d":"7.47 m"},{"v":10.029999999999998,"d":"10.03 m"},{"v":6.19,"d":"6.19 m"},{"v":8.56,"d":"8.56 m"},{"v":5.4,"d":"5.40 m"},{"v":7.600000000000003,"d":"7.60 m"},{"v":4.85,"d":"4.85 m"},{"v":6.899999999999996,"d":"6.90 m"},{"v":4.44,"d":"4.44 m"},{"v":6.360000000000002,"d":"6.36 m"},{"v":4.12,"d":"4.12 m"},{"v":5.940000000000001,"d":"5.94 m"},{"v":3.86,"d":"3.86 m"}]
[{"$nulls":12},"541493+I120",{"v":5.73,"d":"5.73 m"},{"v":7.090000000000002,"d":"7.09 m"},{"v":5.05,"d":"5.05 m"},{"v":6.369999999999998,"d":"6.37 m"},{"v":4.61,"d":"4.61 m"},{"v":5.850000000000002,"d":"5.85 m"},{"v":4.3,"d":"4.30 m"},{"v":5.55,"d":"5.55 m"},{"v":4.05,"d":"4.05 m"},{"v":5.249999999999998,"d":"5.25 m"},{"v":3.85,"d":"3.85 m"},{"v":4.970000000000001,"d":"4.97 m"},{"v":3.69,"d":"3.69 m"},{"$nulls":15},"541493+I120",{"v":7.09,"d":"7.09 m"},{"v":9.549999999999999,"d":"9.55 m"},{"v":5.86,"d":"5.86 m"},{"v":8.11,"d":"8.11 m"},{"v":5.11,"d":"5.11 m"},{"v":7.190000000000002,"d":"7.19 m"},{"v":4.59,"d":"4.59 m"},{"v":6.539999999999998,"d":"6.54 m"},{"v":4.2,"d":"4.20 m"},{"v":6.0600000000000005,"d":"6.06 m"},{"v":3.89,"d":"3.89 m"},{"v":5.570000000000002,"d":"5.57 m"},{"v":3.65,"d":"3.65 m"},{"$nulls":15},"541493+I120",{"v":8.05,"d":"8.05 m"},{"v":10.850000000000001,"d":"10.85 m"},{"v":6.65,"d":"6.65 m"},{"v":9.200000000000003,"d":"9.20 m"},{"v":5.8,"d":"5.80 m"},{"v":8.2,"d":"8.20 m"},{"v":5.2,"d":"5.20 m"},{"v":7.400000000000002,"d":"7.40 m"},{"v":4.76,"d":"4.76 m"},{"v":6.799999999999999,"d":"6.80 m"},{"v":4.42,"d":"4.42 m"},{"v":6.380000000000002,"d":"6.38 m"},{"v":4.14,"d":"4.14 m"}]
[{"$nulls":12},"541493+I120+2*100*10",{"v":6.24,"d":"6.24 m"},{"v":7.600000000000001,"d":"7.60 m"},{"v":5.56,"d":"5.56 m"},{"v":6.9399999999999995,"d":"6.94 m"},{"v":5.1,"d":"5.10 m"},{"v":6.459999999999999,"d":"6.46 m"},{"v":4.76,"d":"4.76 m"},{"v":6.109999999999998,"d":"6.11 m"},{"v":4.49,"d":"4.49 m"},{"v":5.75,"d":"5.75 m"},{"v":4.28,"d":"4.28 m"},{"v":5.5400000000000045,"d":"5.54 m"},{"v":4.1,"d":"4.10 m"},{"$nulls":15},"541493+I120+2*100*10",{"v":8.35,"d":"8.35 m"},{"v":11.069999999999999,"d":"11.07 m"},{"v":6.99,"d":"6.99 m"},{"v":9.57,"d":"9.57 m"},{"v":6.13,"d":"6.13 m"},{"v":8.529999999999998,"d":"8.53 m"},{"v":5.53,"d":"5.53 m"},{"v":7.780000000000001,"d":"7.78 m"},{"v":5.08,"d":"5.08 m"},{"v":7.240000000000002,"d":"7.24 m"},{"v":4.72,"d":"4.72 m"},{"v":6.75,"d":"6.75 m"},{"v":4.43,"d":"4.43 m"},{"$nulls":15},"541493+I120+2*100*10",{"v":9.5,"d":"9.50 m"},{"v":12.6,"d":"12.60 m"},{"v":7.95,"d":"7.95 m"},{"v":10.89,"d":"10.89 m"},{"v":6.97,"d":"6.97 m"},{"v":9.729999999999997,"d":"9.73 m"},{"v":6.28,"d":"6.28 m"},{"v":8.880000000000003,"d":"8.88 m"},{"v":5.76,"d":"5.76 m"},{"v":8.159999999999997,"d":"8.16 m"},{"v":5.36,"d":"5.36 m"},{"v":7.7400000000000055,"d":"7.74 m"},{"v":5.02,"d":"5.02 m"}]
[{"$nulls":12},"541499",{"v":4.09,"d":"4.09 m"},{"v":5.09,"d":"5.09 m"},{"v":3.59,"d":"3.59 m"},{"v":4.58,"d":"4.58 m"},{"v":3.26,"d":"3.26 m"},{"v":4.18,"d":"4.18 m"},{"v":3.03,"d":"3.03 m"},{"v":3.9299999999999984,"d":"3.93 m"},{"v":2.85,"d":"2.85 m"},{"v":3.690000000000001,"d":"3.69 m"},{"v":2.71,"d":"2.71 m"},{"v":3.5500000000000007,"d":"3.55 m"},{"v":2.59,"d":"2.59 m"},{"$nulls":15},"541499",{"v":4.83,"d":"4.83 m"},{"v":6.57,"d":"6.57 m"},{"v":3.96,"d":"3.96 m"},{"v":5.549999999999999,"d":"5.55 m"},{"v":3.43,"d":"3.43 m"},{"v":4.870000000000001,"d":"4.87 m"},{"v":3.07,"d":"3.07 m"},{"v":4.369999999999999,"d":"4.37 m"},{"v":2.81,"d":"2.81 m"},{"v":4.07,"d":"4.07 m"},{"v":2.6,"d":"2.60 m"},{"v":3.7899999999999996,"d":"3.79 m"},{"v":2.43,"d":"2.43 m"},{"$nulls":15},"541499",{"v":5.48,"d":"5.48 m"},{"v":7.460000000000001,"d":"7.46 m"},{"v":4.49,"d":"4.49 m"},{"v":6.290000000000001,"d":"6.29 m"},{"v":3.89,"d":"3.89 m"},{"v":5.49,"d":"5.49 m"},{"v":3.49,"d":"3.49 m"},{"v":4.990000000000002,"d":"4.99 m"},{"v":3.19,"d":"3.19 m"},{"v":4.629999999999999,"d":"4.63 m"},{"v":2.95,"d":"2.95 m"},{"v":4.280000000000003,"d":"4.28 m"},{"v":2.76,"d":"2.76 m"}]
[{"$nulls":12},"541499+120*50*3",{"v":5.25,"d":"5.25 m"},{"v":6.49,"d":"6.49 m"},{"v":4.63,"d":"4.63 m"},{"v":5.86,"d":"5.86 m"},{"v":4.22,"d":"4.22 m"},{"v":5.379999999999998,"d":"5.38 m"},{"v":3.93,"d":"3.93 m"},{"v":5.08,"d":"5.08 m"},{"v":3.7,"d":"3.70 m"},{"v":4.780000000000001,"d":"4.78 m"},{"v":3.52,"d":"3.52 m"},{"v":4.569999999999999,"d":"4.57 m"},{"v":3.37,"d":"3.37 m"},{"$nulls":15},"541499+120*50*3",{"v":6.2,"d":"6.20 m"},{"v":8.36,"d":"8.36 m"},{"v":5.12,"d":"5.12 m"},{"v":7.1000000000000005,"d":"7.10 m"},{"v":4.46,"d":"4.46 m"},{"v":6.3,"d":"6.30 m"},{"v":4,"d":"4.00 m"},{"v":5.699999999999999,"d":"5.70 m"},{"v":3.66,"d":"3.66 m"},{"v":5.2200000000000015,"d":"5.22 m"},{"v":3.4,"d":"3.40 m"},{"v":4.939999999999998,"d":"4.94 m"},{"v":3.18,"d":"3.18 m"},{"$nulls":15},"541499+120*50*3",{"v":7.05,"d":"7.05 m"},{"v":9.530000000000001,"d":"9.53 m"},{"v":5.81,"d":"5.81 m"},{"v":8.059999999999999,"d":"8.06 m"},{"v":5.06,"d":"5.06 m"},{"v":7.139999999999998,"d":"7.14 m"},{"v":4.54,"d":"4.54 m"},{"v":6.489999999999998,"d":"6.49 m"},{"v":4.15,"d":"4.15 m"},{"v":5.950000000000002,"d":"5.95 m"},{"v":3.85,"d":"3.85 m"},{"v":5.530000000000001,"d":"5.53 m"},{"v":3.61,"d":"3.61 m"}]
[{"$nulls":12},"541499+120*50*5",{"v":5.75,"d":"5.75 m"},{"v":7.09,"d":"7.09 m"},{"v":5.08,"d":"5.08 m"},{"v":6.400000000000001,"d":"6.40 m"},{"v":4.64,"d":"4.64 m"},{"v":5.919999999999997,"d":"5.92 m"},{"v":4.32,"d":"4.32 m"},{"v":5.520000000000001,"d":"5.52 m"},{"v":4.08,"d":"4.08 m"},{"v":5.280000000000001,"d":"5.28 m"},{"v":3.88,"d":"3.88 m"},{"v":5.069999999999999,"d":"5.07 m"},{"v":3.71,"d":"3.71 m"},{"$nulls":15},"541499+120*50*5",{"v":7.12,"d":"7.12 m"},{"v":9.559999999999999,"d":"9.56 m"},{"v":5.9,"d":"5.90 m"},{"v":8.15,"d":"8.15 m"},{"v":5.15,"d":"5.15 m"},{"v":7.230000000000002,"d":"7.23 m"},{"v":4.63,"d":"4.63 m"},{"v":6.579999999999998,"d":"6.58 m"},{"v":4.24,"d":"4.24 m"},{"v":6.1000000000000005,"d":"6.10 m"},{"v":3.93,"d":"3.93 m"},{"v":5.68,"d":"5.68 m"},{"v":3.68,"d":"3.68 m"},{"$nulls":15},"541499+120*50*5",{"v":8.09,"d":"8.09 m"},{"v":10.87,"d":"10.87 m"},{"v":6.7,"d":"6.70 m"},{"v":9.250000000000002,"d":"9.25 m"},{"v":5.85,"d":"5.85 m"},{"v":8.249999999999998,"d":"8.25 m"},{"v":5.25,"d":"5.25 m"},{"v":7.450000000000002,"d":"7.45 m"},{"v":4.81,"d":"4.81 m"},{"v":6.9099999999999975,"d":"6.91 m"},{"v":4.46,"d":"4.46 m"},{"v":6.420000000000002,"d":"6.42 m"},{"v":4.18,"d":"4.18 m"}]
[{"$nulls":12},"577275",{"v":6.21,"d":"6.21 m"},{"v":7.69,"d":"7.69 m"},{"v":5.47,"d":"5.47 m"},{"v":6.879999999999999,"d":"6.88 m"},{"v":5,"d":"5.00 m"},{"v":6.359999999999999,"d":"6.36 m"},{"v":4.66,"d":"4.66 m"},{"v":5.959999999999999,"d":"5.96 m"},{"v":4.4,"d":"4.40 m"},{"v":5.66,"d":"5.66 m"},{"v":4.19,"d":"4.19 m"},{"v":5.380000000000006,"d":"5.38 m"},{"v":4.02,"d":"4.02 m"},{"$nulls":9},"4b) Tabellenwert b",{"$f":"AR88","v":{"v":5.64,"d":"5.64 m"}},{"$nulls":4},"577275",{"v":7.26,"d":"7.26 m"},{"v":9.62,"d":"9.62 m"},{"v":6.08,"d":"6.08 m"},{"v":8.39,"d":"8.39 m"},{"v":5.31,"d":"5.31 m"},{"v":7.429999999999997,"d":"7.43 m"},{"v":4.78,"d":"4.78 m"},{"v":6.730000000000003,"d":"6.73 m"},{"v":4.39,"d":"4.39 m"},{"v":6.249999999999997,"d":"6.25 m"},{"v":4.08,"d":"4.08 m"},{"v":5.83,"d":"5.83 m"},{"v":3.83,"d":"3.83 m"},{"$nulls":9},"4c) Tabellenwert b",{"$f":"BU88","v":{"v":6.38,"d":"6.38 m"}},{"$nulls":4},"577275",{"v":8.33,"d":"8.33 m"},{"v":11.23,"d":"11.23 m"},{"v":6.88,"d":"6.88 m"},{"v":9.52,"d":"9.52 m"},{"v":6,"d":"6.00 m"},{"v":8.399999999999999,"d":"8.40 m"},{"v":5.4,"d":"5.40 m"},{"v":7.650000000000001,"d":"7.65 m"},{"v":4.95,"d":"4.95 m"},{"v":7.050000000000003,"d":"7.05 m"},{"v":4.6,"d":"4.60 m"},{"v":6.559999999999995,"d":"6.56 m"},{"v":4.32,"d":"4.32 m"}]
[{"$nulls":12},"577275+140*40*3",{"v":6.96,"d":"6.96 m"},{"v":8.559999999999999,"d":"8.56 m"},{"v":6.16,"d":"6.16 m"},{"v":7.7200000000000015,"d":"7.72 m"},{"v":5.64,"d":"5.64 m"},{"v":7.12,"d":"7.12 m"},{"v":5.27,"d":"5.27 m"},{"v":6.719999999999995,"d":"6.72 m"},{"v":4.98,"d":"4.98 m"},{"v":6.360000000000003,"d":"6.36 m"},{"v":4.75,"d":"4.75 m"},{"v":6.150000000000001,"d":"6.15 m"},{"v":4.55,"d":"4.55 m"},{"$nulls":9},"4b) Korrigierter bzul",{"$f":"AK83*AK72*AK73*AK74*AK75*AK76*AK77","v":{"v":5.1088248,"d":"5.11 m"}},{"$nulls":4},"577275+140*40*3",{"v":8.59,"d":"8.59 m"},{"v":11.469999999999999,"d":"11.47 m"},{"v":7.15,"d":"7.15 m"},{"v":9.820000000000002,"d":"9.82 m"},{"v":6.26,"d":"6.26 m"},{"v":8.74,"d":"8.74 m"},{"v":5.64,"d":"5.64 m"},{"v":7.9399999999999995,"d":"7.94 m"},{"v":5.18,"d":"5.18 m"},{"v":7.339999999999996,"d":"7.34 m"},{"v":4.82,"d":"4.82 m"},{"v":6.8500000000000005,"d":"6.85 m"},{"v":4.53,"d":"4.53 m"},{"$nulls":9},"4c) Korrigierter bzul",{"$f":"BN83*BN72*BN73*BN74*BN75*BN76*BN77","v":{"v":59334,"d":"59,334.00 m"}},{"$nulls":4},"577275+140*40*3",{"v":9.74,"d":"9.74 m"},{"v":13.040000000000001,"d":"13.04 m"},{"v":8.09,"d":"8.09 m"},{"v":11.12,"d":"11.12 m"},{"v":7.08,"d":"7.08 m"},{"v":9.88,"d":"9.88 m"},{"v":6.38,"d":"6.38 m"},{"v":9.030000000000001,"d":"9.03 m"},{"v":5.85,"d":"5.85 m"},{"v":8.309999999999995,"d":"8.31 m"},{"v":5.44,"d":"5.44 m"},{"v":7.750000000000001,"d":"7.75 m"},{"v":5.11,"d":"5.11 m"}]
[{"$nulls":12},"577275+140*40*5",{"v":7.22,"d":"7.22 m"},{"v":8.84,"d":"8.84 m"},{"v":6.41,"d":"6.41 m"},{"v":8,"d":"8.00 m"},{"v":5.88,"d":"5.88 m"},{"v":7.439999999999999,"d":"7.44 m"},{"v":5.49,"d":"5.49 m"},{"v":6.94,"d":"6.94 m"},{"v":5.2,"d":"5.20 m"},{"v":6.6400000000000015,"d":"6.64 m"},{"v":4.96,"d":"4.96 m"},{"v":6.43,"d":"6.43 m"},{"v":4.75,"d":"4.75 m"},{"$nulls":15},"577275+140*40*5",{"v":9.1,"d":"9.10 m"},{"v":12.12,"d":"12.12 m"},{"v":7.59,"d":"7.59 m"},{"v":10.379999999999999,"d":"10.38 m"},{"v":6.66,"d":"6.66 m"},{"v":9.260000000000002,"d":"9.26 m"},{"v":6.01,"d":"6.01 m"},{"v":8.46,"d":"8.46 m"},{"v":5.52,"d":"5.52 m"},{"v":7.799999999999999,"d":"7.80 m"},{"v":5.14,"d":"5.14 m"},{"v":7.309999999999997,"d":"7.31 m"},{"v":4.83,"d":"4.83 m"},{"$nulls":15},"577275+140*40*5",{"v":10.31,"d":"10.31 m"},{"v":13.730000000000002,"d":"13.73 m"},{"v":8.6,"d":"8.60 m"},{"v":11.779999999999998,"d":"11.78 m"},{"v":7.54,"d":"7.54 m"},{"v":10.5,"d":"10.50 m"},{"v":6.8,"d":"6.80 m"},{"v":9.599999999999998,"d":"9.60 m"},{"v":6.24,"d":"6.24 m"},{"v":8.820000000000004,"d":"8.82 m"},{"v":5.81,"d":"5.81 m"},{"v":8.259999999999998,"d":"8.26 m"},{"v":5.46,"d":"5.46 m"}]
[]
[{"$nulls":12},"4a) Unterzug","lm","b",{"$nulls":26},"4b) Unterzug","lm","b",{"$nulls":26},"4c) Unterzug","lm","b"]
[{"$nulls":12},{"$f":"IF($D$40=\"\",\"\",MATCH($D$40,M72:M85))","v":13},{"$f":"IF($D$39=\"\",\"\",MATCH($D$38,$N$71:$Z$71,0))","v":7},{"$f":"IF(OR($D$40=\"\",$D$39=\"\"),0,INDEX(N72:Z85,M88,N88))","v":{"v":5.27,"d":"5.27 m"}},{"$nulls":26},{"$f":"IF($D$40=\"\",\"\",MATCH($D$40,AP72:AP85))","v":13},{"$f":"IF($D$39=\"\",\"\",MATCH($D$38,AQ71:BC71,0))","v":7},{"$f":"IF(OR($D$40=\"\",$D$39=\"\"),0,INDEX(AQ72:BC85,AP88,AQ88))","v":{"v":5.64,"d":"5.64 m"}},{"$nulls":26},{"$f":"IF($D$40=\"\",\"\",MATCH($D$40,BS72:BS85))","v":13},{"$f":"IF($D$39=\"\",\"\",MATCH($D$38,BT71:CF71,0))","v":7},{"$f":"IF(OR($D$40=\"\",$D$39=\"\"),0,INDEX(BT72:CF85,BS88,BT88))","v":{"v":6.38,"d":"6.38 m"}}]

{"sheet":"Satteldach unisoliert","index":4,"n_rows":39,"n_cols":4,"rows_kept":39,"merged":[[3,0,3,5],[18,2,18,5]]}
[null,"Kunde:",null,{"$f":"'Ermittlung Schneelast'!D6","v":{"v":0,"d":"0.00"}}]
[null,"BV:",null,{"$f":"'Ermittlung Schneelast'!D7","v":{"v":0,"d":"0.00"}}]
[]
["Satteldach unisoliert, ohne Firstpfette, ohne Zuganker"]
[]
["Nachweis Träger: vereinfachte, überschlägliche Bemessung"]
["lvorh","=",{"$f":"'Ermittlung Schneelast'!_b2","v":{"v":3.5,"d":"3.50 m"}}]
["l1, zul","=",{"$f":"'Bemessungstabelle unisoliert'!H15","v":{"v":3.2209600000000003,"d":"3.22 m"}}]
["l2, zul","=",{"$f":"'Bemessungstabelle unisoliert'!AK22","v":{"v":3.93496,"d":"3.93 m"}}]
["l3, zul","=",{"$f":"'Bemessungstabelle unisoliert'!BN22","v":{"v":45950.00000000001,"d":"45,950.00 m"}}]
["Durchbiegung w","=",{"$f":"'Bemessungstabelle unisoliert'!D16","v":{"v":22.799993766846093,"d":"22.8 mm"}}]
["Dachneigung WG","=",{"$f":"'Ermittlung Schneelast'!D18","v":{"v":10,"d":"10.0°"}}]
[]
["Nachweis der vertikalen Durchbiegung"]
["lvorh","<=","l1, zul"]
[{"$f":"C7","v":{"v":3.5,"d":"3.50 m"}},{"$f":"IF(A16<=C16,\"<=\",\">\")","v":">"},{"$f":"C8","v":{"v":3.2209600000000003,"d":"3.22 m"}},{"$f":"IF(A16<=C16,\"Bedingung erfüllt\",\"Bedingung nicht erfüllt!!\")","v":"Bedingung nicht erfüllt!!"}]
[]
["Nachweis der Spannung im Firstpunkt"]
["Profil und Stahleinschub im Firstbereich","=","543004+70*30*3  auf ganzer Länge + 62*22 im First"]
["Korrekturfaktor k","=",{"$f":"VLOOKUP(C19,Daten!A79:B101,2)","v":0.73}]
[]
["lvorh","<=","l2, zul * k"]
[{"$f":"C7","v":{"v":3.5,"d":"3.50 m"}},{"$f":"IF(A23<=C23,\"<=\",\">\")","v":">"},{"$f":"C9*C20","v":{"v":2.8725207999999998,"d":"2.87 m"}},{"$f":"IF(A23<=C23,\"Bedingung erfüllt\",\"Bedingung nicht erfüllt!!\")","v":"Bedingung nicht erfüllt!!"}]
[]
["lvorh","<=","l3, zul * k"]
[{"$f":"C7","v":{"v":3.5,"d":"3.50 m"}},{"$f":"IF(A26<=C26,\"<=\",\">\")","v":"<="},{"$f":"C10*C20","v":{"v":33543.50000000001,"d":"33,543.50 m"}},{"$f":"IF(A26<=C26,\"Bedingung erfüllt\",\"Bedingung nicht erfüllt!!\")","v":"Bedingung erfüllt"}]
[]
["Nachweis der horizontalen Rinnenverschiebung u"]
["Rinnenlänge b","=",{"v":5.2,"d":"5.20 m"}]
["Anzahl Rinnen, die verschiebbar sind","=",{"v":2,"d":"2  Rinne(n)"}]
[]
["u","<=","8 mm oder b/500"]
[{"$f":"IF(C30=2,C11*TAN(C12*PI()/180)*1,IF(C30=1,C11*TAN(C12*PI()/180)*2,\"nicht möglich\"))","v":{"v":4.020254061079792,"d":"4.0 mm"}},{"$f":"IF(A33<=C33,\"<=\",\">\")","v":"<="},{"$f":"IF(8<C29*1000/500,8,C29*1000/500)","v":{"v":8,"d":"8.0 mm"}},{"$f":"IF(A33<=C33,\"Bedingung erfüllt\",\"Bedingung nicht erfüllt!!\")","v":"Bedingung erfüllt"}]
[]
["Nachweis Rinne: vereinfachte, überschlägliche Bemessung der Durchbiegung"]
[]
[{"$f":"'Bemessungstabelle unisoliert'!B28","v":{"v":4,"d":"4.00 m"}},{"$f":"IF(A37<=C37,\"<=\",\">\")","v":"<="},{"$f":"'Bemessungstabelle unisoliert'!D28*0.9","v":{"v":5.731123140000001,"d":"5.73 m"}},{"$f":"IF(A37<=C37,\"Bedingung erfüllt\",\"Bedingung nicht erfüllt!!\")","v":"Bedingung erfüllt"}]
[]
["Berechnungsgrundlage: Skribt \"Schulung am 28.11.2012 bei TS-Aluminium in Großefehn\", Autor Herr Meier-Hedde"]

{"sheet":"Daten","index":5,"n_rows":110,"n_cols":13,"rows_kept":110}
[1,null,"1, Binnenland","ja"]
["1a",null,"2, Binnenland","nein",{"$nulls":8},"Dachneigungen"]
[2,null,"2, Küste und Inseln der Ostsee",{"$nulls":9},"für Statiktabellen"]
["2a",null,"3, Binnenland",{"$nulls":9},{"v":15,"d":"15°"}]
[3,null,"3, Küste und Inseln der Ostsee",{"$nulls":9},{"v":15,"d":"15°"}]
[null,null,"4, Binnenland",{"$nulls":9},{"v":15,"d":"15°"}]
["Dach an der Giebelseite",null,"4, Küste der Nord- und Ostsee und Inseln der Ostsee"]
["Dach an der Traufseite",null,"4, Inseln der Nordsee",{"$nulls":9},{"v":15,"d":"15°"}]
["Dach an ein Flachdach",{"$nulls":11},{"v":15,"d":"15°"}]
[{"$nulls":12},{"v":15,"d":"15°"}]
[]
[]
["Korrekturfaktor k für Rinnenermittlung",null,null,"Korrekturfaktor k für Rinnenermittlung"]
["Serie Veranda",null,null,"Serie T"]
["sDa","k - Serie Veranda",null,"sDa","k - Serie T"]
[{"v":1.5,"d":"1.500 kN/qm"},{"$f":"1-('Ermittlung Schneelast'!$D$19-5)*0.04+(1.5-'Ermittlung Schneelast'!#REF!)*0.04","v":{"$error":"#REF!"}},null,{"v":1.5,"d":"1.500 kN/qm"},{"$f":"1-('Ermittlung Schneelast'!$D$19-3.5)*0.025+(1.5-'Ermittlung Schneelast'!#REF!)*0.1","v":{"$error":"#REF!"}}]
[{"v":2,"d":"2.000 kN/qm"},{"$f":"1-('Ermittlung Schneelast'!$D$19-4.25)*0.04+(2-'Ermittlung Schneelast'!#REF!)*0.06","v":{"$error":"#REF!"}},null,{"v":2,"d":"2.000 kN/qm"},{"$f":"1-('Ermittlung Schneelast'!$D$19-3)*0.03+(2-'Ermittlung Schneelast'!#REF!)*0.05","v":{"$error":"#REF!"}}]
[{"v":2.5,"d":"2.500 kN/qm"},{"$f":"1-('Ermittlung Schneelast'!$D$19-3.5)*0.04+(2.5-'Ermittlung Schneelast'!#REF!)*0.06","v":{"$error":"#REF!"}},null,{"v":2.5,"d":"2.500 kN/qm"},{"$f":"1-('Ermittlung Schneelast'!$D$19-2.5)*0.035+(2.5-'Ermittlung Schneelast'!#REF!)*0.06","v":{"$error":"#REF!"}}]
[{"v":3,"d":"3.000 kN/qm"},{"$f":"1-('Ermittlung Schneelast'!$D$19-3)*0.04+(3-'Ermittlung Schneelast'!#REF!)*0.04","v":{"$error":"#REF!"}},null,{"v":3,"d":"3.000 kN/qm"},{"$f":"1-('Ermittlung Schneelast'!$D$19-2)*0.04+(3-'Ermittlung Schneelast'!#REF!)*0.07","v":{"$error":"#REF!"}}]
[]
[]
["l/200",200]
["l/250",250]
["l/300",300]
["l/500",500]
["vorhanden"]
["nicht vorhanden"]
[]
["1","1, Binnenland","ja","vorhanden"]
["1a","2, Binnenland","nein","nicht vorhanden"]
["2","2, Küste und Inseln der Ostsee"]
["2a","3, Binnenland"]
["3","3, Küste und Inseln der Ostsee"]
["3a","4, Binnenland"]
[null,"4, Küste der Nord- und Ostsee und Inseln der Ostsee"]
[null,"4, Inseln der Nordsee"]
["für isoliert!","Bemessungstabelle a isoliert","Bemessungstabelle b isoliert","Bemessungstabelle c isoliert",null,"für unisoliert!","Bemessungstabelle unisoliert (gilt für alle)"]
["10mm VSG",1.02,1.03,1.02,null,"10mm VSG",1]
["8mm VSG",1.01,1.01,1.01,null,"8mm VSG",1.01]
["ISO-VSG (6+8), 14mm Glasdicke",1,1,1,null,"ISO-VSG (6+8)",0.98]
["ISO-VSG (8+4+6), 18mm Glasdicke",0.98,0.97,0.97,null,"ISO-VSG (8+4+6)",0.98]
["ISO-VSG (8+6+8), 22mm Glasdicke",0.96,0.94,0.95,null,"ISO-VSG (8+4+8)",0.98]
["Stegplatte",1.07,1.1,1.08,null,"Stegplatte",1.04]
["l/200",1]
["l/250",0.93]
["l/300",0.873]
["l/500",0.74]
[]
[null,"Bemessungstabelle 1-4a unisoliert","Bemessungstabelle 1-4b unisoliert","Bemessungstabelle isoliert (gilt für alle Träger)","Bemessungstabelle isoliert 2a: Rinne 2.1","Bemessungstabelle isoliert 2b: Rinne 2.1"]
["1, Binnenland",1,1,1,1,1]
["2, Binnenland",1,1,1,1,1]
["2, Küste und Inseln der Ostsee",0.96,0.95,0.98,0.98,0.97]
["3, Binnenland",0.98,0.98,0.99,0.99,0.99]
["3, Küste und Inseln der Ostsee",0.96,0.95,0.98,0.98,0.97]
["4, Binnenland",0.96,0.95,0.98,0.98,0.97]
["4, Inseln der Nordsee",0.94,0.91,0.97,0.96,0.94]
["4, Küste der Nord- und Ostsee und Inseln der Ostsee",0.94,0.91,0.97,0.96,0.94]
[]
[]
[]
[]
["Träger","k"]
["577335+70*30*3 auf ganzer Länge + 62*22 im First",{"v":1,"d":"1.00"}]
["577335+70*30*3 auf ganzer Länge, kein Stahl im Stahl",0.63]
["577335+70*30*3 im Firstbereich",{"v":0.8,"d":"0.80"}]
["577339+80*60*3 auf ganzer Länge +70*50*5 im First",0.91]
["577339+80*60*3 auf ganzer Länge, kein Stahl im Stahl",0.63]
["577339+80*60*5 auf ganzer Länge +70*50*5 im First",0.93]
["577339+80*60*5 auf ganzer Länge, kein Stahl im Stahl",0.71]
["577339+80*60*5 im Firstbereich",0.94]
["579500+100*50*4 auf ganzer Länge +90*40*5 im First",{"v":0.9,"d":"0.90"}]
["579500+100*50*4 auf ganzer Länge, kein Stahl in Stahl",0.66]
["579500+100*50*4 im Firstbereich",0.75]
[]
[]
[]
[]
["Träger","k"]
["261051+100*10 auf ganzer Länge",0.81]
["261051+100*10 im Firstbereich",{"v":1,"d":"1.00"}]
["261052+80*10 auf ganzer Länge",0.62]
["261052+80*10 im Firstbereich",0.77]
["261071+100*10 auf ganzer Länge",{"v":0.7,"d":"0.70"}]
["261071+100*10 im Firstbereich",0.95]
["261072+100*10 auf ganzer Länge",0.59]
["261072+100*10 im Firstbereich",{"v":0.7,"d":"0.70"}]
["5415142+140*15 auf ganzer Länge",0.85]
["5415142+140*15 im Firstbereich",{"v":1,"d":"1.00"}]
["543002+70*30*3  auf ganzer Länge",0.45]
["543002+70*30*3  auf ganzer Länge + 62*22 im First",0.73]
["543002+70*30*3  im Firstbereich",{"v":0.5,"d":"0.50"}]
["543002+70*30*3  im Firstbereich + 62*22 im First",0.81]
["543002+80*10 auf ganzer Länge",0.48]
["543002+80*10 im Firstbereich",0.55]
["543004+70*30*3  auf ganzer Länge",0.45]
["543004+70*30*3  auf ganzer Länge + 62*22 im First",0.73]
["543004+70*30*3  im Firstbereich",{"v":0.5,"d":"0.50"}]
["543004+70*30*3  im Firstbereich + 62*22 im First",0.81]
["543004+80*10 auf ganzer Länge",0.48]
["543004+80*10 im Firstbereich",0.55]
["543005+70*30*3  im Firstbereich",0.61]
[]
[]
["1-Feldbalken b",{"v":1,"d":"1.00"}]
["2-Feldbalken b + 0,5*b",1.22]
["2-Feldbalken b + 0,75*b",1.23]
["2-Feldbalken b + b",1.34]
["3-Feldbalken 0,5*b + b + 0,5*b",1.45]
["3-Feldbalken 0,75*b + b + 0,75*b",{"v":1.5,"d":"1.50"}]
["3-Feldbalken b + b + b",1.24]

{"sheet":"Info","index":6,"n_rows":7,"n_cols":3,"rows_kept":7,"merged":[[0,0,0,2],[2,0,3,0],[5,0,6,0]]}
["Grenzwerte der Gebrauchstauglichkeit"]
[]
["Träger","isoliert","l/200"]
[null,"unisoiert","l/200"]
[]
["Rinne/Unterzug/Traverse","isoliert","l/300"]
[null,"unisoiert","l/200, jedoch nicht > 26mm"]

{"sheet":"Statiktabellen","index":7,"n_rows":38,"n_cols":36,"rows_kept":38,"hidden":true}
[null,"Träger isoliert",{"$nulls":16},"Rinnen isoliert",{"$nulls":11},"Unterzug 541493 unisoliert"]
[]
[null,"Randbedingungen",{"$nulls":16},"Randbedingungen",{"$nulls":11},"Randbedingungen"]
[null,"Schneelast:",{"$f":"'Bemessungstabelle isoliert'!D6","v":{"v":1.1,"d":"1.10 kN/qm"}},{"$nulls":15},"Schneelast:",{"$f":"'Bemessungstabelle isoliert'!#REF!","v":{"$error":"#REF!"}},{"$nulls":10},"Schneelast:",{"$f":"'Bemessungstabelle unisoliert'!D50","v":{"v":0,"d":"0.00 kN/qm"}}]
[null,"Windzone:",{"$f":"'Bemessungstabelle isoliert'!D8","v":"1, Binnenland"},{"$nulls":15},"Windzone:",{"$f":"'Bemessungstabelle isoliert'!#REF!","v":{"$error":"#REF!"}},{"$nulls":10},"Windzone:",{"$f":"'Bemessungstabelle unisoliert'!D51","v":{"v":0,"d":"0.00 kN/qm"}}]
[null,"Verglasung:",{"$f":"'Bemessungstabelle isoliert'!D5","v":"ISO-VSG (6+8), 14mm Glasdicke"},{"$nulls":15},"Verglasung:",{"$f":"'Bemessungstabelle isoliert'!#REF!","v":{"$error":"#REF!"}},{"$nulls":10},"Verglasung:",{"$f":"'Bemessungstabelle unisoliert'!#REF!","v":{"$error":"#REF!"}}]
[null,"Dachneigung:",{"$f":"'Bemessungstabelle isoliert'!D9","v":{"v":10,"d":"10.0°"}},{"$nulls":15},"Dachneigung:",{"$f":"'Bemessungstabelle isoliert'!#REF!","v":{"$error":"#REF!"}},{"$nulls":10},"Dachneigung:",{"$f":"'Bemessungstabelle unisoliert'!D52","v":{"v":0,"d":"0.0°"}}]
[null,"Achsabstand:",{"$f":"'Bemessungstabelle isoliert'!D12","v":{"v":0.73,"d":"0.73 m"}},{"$nulls":15},"Achsabstand:",{"$f":"'Bemessungstabelle isoliert'!D12","v":{"v":0.73,"d":"0.73 m"}},{"$nulls":10},"Achsabstand:",{"$f":"'Bemessungstabelle unisoliert'!D12","v":{"v":0.85,"d":"0.85 m"}}]
[null,"zul. Durchbiegung:",{"$f":"'Bemessungstabelle isoliert'!D13","v":"l/200"},{"$nulls":15},"zul. Durchbiegung:",{"$f":"'Bemessungstabelle isoliert'!D27","v":"l/300"},{"$nulls":10},"zul. Durchbiegung:",{"$f":"'Bemessungstabelle unisoliert'!D41","v":"l/250"}]
[]
[null,"Sparrenabstand","577100","577100+120*50*3","577100+120*50*5","577100+I120","577233","577233+30*30*2","577235","577235+70*30*3","577239","577239+80*60*3","577239+80*60*5","577240","577240+50*10","579275","579275+100*50*4",null,"Tiefe","5772033","5772033+100*20*3","5772033+120*10+100*20*3","577207","577207+110*15","5772424","5772424+I120","5772424+U120","579225","579225+100*50*4",null,"Tiefe","541493","541493+120*50*3","541493+120*50*5","541493+I120","541493+U120"]
[null,{"v":0.5,"d":"0.50 m"},{"$f":"'Bemessungstabelle isoliert'!$N2*'Bemessungstabelle isoliert'!$H$2*'Bemessungstabelle isoliert'!$H$3*'Bemessungstabelle isoliert'!$H$4*'Bemessungstabelle isoliert'!$H$5*'Bemessungstabelle isoliert'!$H$6","v":{"v":5.85272,"d":"5.85 m"}},{"$f":"'Bemessungstabelle isoliert'!$N3*'Bemessungstabelle isoliert'!$H$2*'Bemessungstabelle isoliert'!$H$3*'Bemessungstabelle isoliert'!$H$4*'Bemessungstabelle isoliert'!$H$5*'Bemessungstabelle isoliert'!$H$6","v":{"v":6.90346,"d":"6.90 m"}},{"$f":"'Bemessungstabelle isoliert'!$N4*'Bemessungstabelle isoliert'!$H$2*'Bemessungstabelle isoliert'!$H$3*'Bemessungstabelle isoliert'!$H$4*'Bemessungstabelle isoliert'!$H$5*'Bemessungstabelle isoliert'!$H$6","v":{"v":7.37482,"d":"7.37 m"}},{"$f":"'Bemessungstabelle isoliert'!$N5*'Bemessungstabelle isoliert'!$H$2*'Bemessungstabelle isoliert'!$H$3*'Bemessungstabelle isoliert'!$H$4*'Bemessungstabelle isoliert'!$H$5*'Bemessungstabelle isoliert'!$H$6","v":{"v":7.67924,"d":"7.68 m"}},{"$f":"'Bemessungstabelle isoliert'!$N6*'Bemessungstabelle isoliert'!$H$2*'Bemessungstabelle isoliert'!$H$3*'Bemessungstabelle isoliert'!$H$4*'Bemessungstabelle isoliert'!$H$5*'Bemessungstabelle isoliert'!$H$6","v":{"v":2.49428,"d":"2.49 m"}},{"$f":"'Bemessungstabelle isoliert'!$N7*'Bemessungstabelle isoliert'!$H$2*'Bemessungstabelle isoliert'!$H$3*'Bemessungstabelle isoliert'!$H$4*'Bemessungstabelle isoliert'!$H$5*'Bemessungstabelle isoliert'!$H$6","v":{"v":2.5532,"d":"2.55 m"}},{"$f":"'Bemessungstabelle isoliert'!$N8*'Bemessungstabelle isoliert'!$H$2*'Bemessungstabelle isoliert'!$H$3*'Bemessungstabelle isoliert'!$H$4*'Bemessungstabelle isoliert'!$H$5*'Bemessungstabelle isoliert'!$H$6","v":{"v":3.62358,"d":"3.62 m"}},{"$f":"'Bemessungstabelle isoliert'!$N9*'Bemessungstabelle isoliert'!$H$2*'Bemessungstabelle isoliert'!$H$3*'Bemessungstabelle isoliert'!$H$4*'Bemessungstabelle isoliert'!$H$5*'Bemessungstabelle isoliert'!$H$6","v":{"v":4.19314,"d":"4.19 m"}},{"$f":"'Bemessungstabelle isoliert'!$N10*'Bemessungstabelle isoliert'!$H$2*'Bemessungstabelle isoliert'!$H$3*'Bemessungstabelle isoliert'!$H$4*'Bemessungstabelle isoliert'!$H$5*'Bemessungstabelle isoliert'!$H$6","v":{"v":4.605580000000001,"d":"4.61 m"}},{"$f":"'Bemessungstabelle isoliert'!$N11*'Bemessungstabelle isoliert'!$H$2*'Bemessungstabelle isoliert'!$H$3*'Bemessungstabelle isoliert'!$H$4*'Bemessungstabelle isoliert'!$H$5*'Bemessungstabelle isoliert'!$H$6","v":{"v":5.33226,"d":"5.33 m"}},{"$f":"'Bemessungstabelle isoliert'!$N12*'Bemessungstabelle isoliert'!$H$2*'Bemessungstabelle isoliert'!$H$3*'Bemessungstabelle isoliert'!$H$4*'Bemessungstabelle isoliert'!$H$5*'Bemessungstabelle isoliert'!$H$6","v":{"v":5.63668,"d":"5.64 m"}},{"$f":"'Bemessungstabelle isoliert'!#REF!*'Bemessungstabelle isoliert'!$H$2*'Bemessungstabelle isoliert'!$H$3*'Bemessungstabelle isoliert'!$H$4*'Bemessungstabelle isoliert'!$H$5*'Bemessungstabelle isoliert'!$H$6","v":{"$error":"#REF!"}},{"$f":"'Bemessungstabelle isoliert'!#REF!*'Bemessungstabelle isoliert'!$H$2*'Bemessungstabelle isoliert'!$H$3*'Bemessungstabelle isoliert'!$H$4*'Bemessungstabelle isoliert'!$H$5*'Bemessungstabelle isoliert'!$H$6","v":{"$error":"#REF!"}},{"$f":"'Bemessungstabelle isoliert'!#REF!*'Bemessungstabelle isoliert'!$H$2*'Bemessungstabelle isoliert'!$H$3*'Bemessungstabelle isoliert'!$H$4*'Bemessungstabelle isoliert'!$H$5*'Bemessungstabelle isoliert'!$H$6","v":{"$error":"#REF!"}},{"$f":"'Bemessungstabelle isoliert'!#REF!*'Bemessungstabelle isoliert'!$H$2*'Bemessungstabelle isoliert'!$H$3*'Bemessungstabelle isoliert'!$H$4*'Bemessungstabelle isoliert'!$H$5*'Bemessungstabelle isoliert'!$H$6","v":{"$error":"#REF!"}},null,{"v":2,"d":"2.00 m"},{"$f":"'Bemessungstabelle isoliert'!$R42*'Bemessungstabelle isoliert'!$H$42*'Bemessungstabelle isoliert'!$H$43*'Bemessungstabelle isoliert'!$H$44*'Bemessungstabelle isoliert'!$H$45*'Bemessungstabelle isoliert'!$H$46*'Bemessungstabelle isoliert'!#REF!*'Bemessungstabelle isoliert'!$H$47","v":{"$error":"#REF!"}},{"$f":"'Bemessungstabelle isoliert'!$R43*'Bemessungstabelle isoliert'!$H$42*'Bemessungstabelle isoliert'!$H$43*'Bemessungstabelle isoliert'!$H$44*'Bemessungstabelle isoliert'!$H$45*'Bemessungstabelle isoliert'!$H$46*'Bemessungstabelle isoliert'!#REF!*'Bemessungstabelle isoliert'!$H$47","v":{"$error":"#REF!"}},{"$f":"'Bemessungstabelle isoliert'!$R44*'Bemessungstabelle isoliert'!$H$42*'Bemessungstabelle isoliert'!$H$43*'Bemessungstabelle isoliert'!$H$44*'Bemessungstabelle isoliert'!$H$45*'Bemessungstabelle isoliert'!$H$46*'Bemessungstabelle isoliert'!#REF!*'Bemessungstabelle isoliert'!$H$47","v":{"$error":"#REF!"}},{"$f":"'Bemessungstabelle isoliert'!$R45*'Bemessungstabelle isoliert'!$H$42*'Bemessungstabelle isoliert'!$H$43*'Bemessungstabelle isoliert'!$H$44*'Bemessungstabelle isoliert'!$H$45*'Bemessungstabelle isoliert'!$H$46*'Bemessungstabelle isoliert'!#REF!*'Bemessungstabelle isoliert'!$H$47","v":{"$error":"#REF!"}},{"$f":"'Bemessungstabelle isoliert'!$R46*'Bemessungstabelle isoliert'!$H$42*'Bemessungstabelle isoliert'!$H$43*'Bemessungstabelle isoliert'!$H$44*'Bemessungstabelle isoliert'!$H$45*'Bemessungstabelle isoliert'!$H$46*'Bemessungstabelle isoliert'!#REF!*'Bemessungstabelle isoliert'!$H$47","v":{"$error":"#REF!"}},{"$f":"'Bemessungstabelle isoliert'!$R47*'Bemessungstabelle isoliert'!$H$42*'Bemessungstabelle isoliert'!$H$43*'Bemessungstabelle isoliert'!$H$44*'Bemessungstabelle isoliert'!$H$45*'Bemessungstabelle isoliert'!$H$46*'Bemessungstabelle isoliert'!#REF!*'Bemessungstabelle isoliert'!$H$47","v":{"$error":"#REF!"}},{"$f":"'Bemessungstabelle isoliert'!$R48*'Bemessungstabelle isoliert'!$H$42*'Bemessungstabelle isoliert'!$H$43*'Bemessungstabelle isoliert'!$H$44*'Bemessungstabelle isoliert'!$H$45*'Bemessungstabelle isoliert'!$H$46*'Bemessungstabelle isoliert'!#REF!*'Bemessungstabelle isoliert'!$H$47","v":{"$error":"#REF!"}},{"$f":"'Bemessungstabelle isoliert'!$R49*'Bemessungstabelle isoliert'!$H$42*'Bemessungstabelle isoliert'!$H$43*'Bemessungstabelle isoliert'!$H$44*'Bemessungstabelle isoliert'!$H$45*'Bemessungstabelle isoliert'!$H$46*'Bemessungstabelle isoliert'!#REF!*'Bemessungstabelle isoliert'!$H$47","v":{"$error":"#REF!"}},{"$f":"'Bemessungstabelle isoliert'!$R50*'Bemessungstabelle isoliert'!$H$42*'Bemessungstabelle isoliert'!$H$43*'Bemessungstabelle isoliert'!$H$44*'Bemessungstabelle isoliert'!$H$45*'Bemessungstabelle isoliert'!$H$46*'Bemessungstabelle isoliert'!#REF!*'Bemessungstabelle isoliert'!$H$47","v":{"$error":"#REF!"}},{"$f":"'Bemessungstabelle isoliert'!$R51*'Bemessungstabelle isoliert'!$H$42*'Bemessungstabelle isoliert'!$H$43*'Bemessungstabelle isoliert'!$H$44*'Bemessungstabelle isoliert'!$H$45*'Bemessungstabelle isoliert'!$H$46*'Bemessungstabelle isoliert'!#REF!*'Bemessungstabelle isoliert'!$H$47","v":{"$error":"#REF!"}},null,{"v":3,"d":"3.00 m"},{"$f":"'Bemessungstabelle unisoliert'!$P75*'Bemessungstabelle unisoliert'!$H$66*'Bemessungstabelle unisoliert'!$H$67*'Bemessungstabelle unisoliert'!$H$68*'Bemessungstabelle unisoliert'!$H$69*'Bemessungstabelle unisoliert'!$H$70*'Bemessungstabelle unisoliert'!$H$71","v":{"v":2.6849844000000003,"d":"2.68 m"}},{"$f":"'Bemessungstabelle unisoliert'!#REF!*'Bemessungstabelle unisoliert'!$H$66*'Bemessungstabelle unisoliert'!$H$67*'Bemessungstabelle unisoliert'!$H$68*'Bemessungstabelle unisoliert'!$H$69*'Bemessungstabelle unisoliert'!$H$70*'Bemessungstabelle unisoliert'!$H$71","v":{"$error":"#REF!"}},{"$f":"'Bemessungstabelle unisoliert'!$P74*'Bemessungstabelle unisoliert'!$H$66*'Bemessungstabelle unisoliert'!$H$67*'Bemessungstabelle unisoliert'!$H$68*'Bemessungstabelle unisoliert'!$H$69*'Bemessungstabelle unisoliert'!$H$70*'Bemessungstabelle unisoliert'!$H$71","v":{"v":6.438483,"d":"6.44 m"}},{"$f":"'Bemessungstabelle unisoliert'!#REF!*'Bemessungstabelle unisoliert'!$H$66*'Bemessungstabelle unisoliert'!$H$67*'Bemessungstabelle unisoliert'!$H$68*'Bemessungstabelle unisoliert'!$H$69*'Bemessungstabelle unisoliert'!$H$70*'Bemessungstabelle unisoliert'!$H$71","v":{"$error":"#REF!"}},{"$f":"'Bemessungstabelle unisoliert'!$P76*'Bemessungstabelle unisoliert'!$H$66*'Bemessungstabelle unisoliert'!$H$67*'Bemessungstabelle unisoliert'!$H$68*'Bemessungstabelle unisoliert'!$H$69*'Bemessungstabelle unisoliert'!$H$70*'Bemessungstabelle unisoliert'!$H$71","v":{"v":3.9270180000000003,"d":"3.93 m"}}]
[null,{"v":0.6,"d":"0.60 m"},{"$f":"'Bemessungstabelle isoliert'!$P2*'Bemessungstabelle isoliert'!$H$2*'Bemessungstabelle isoliert'!$H$3*'Bemessungstabelle isoliert'!$H$4*'Bemessungstabelle isoliert'!$H$5*'Bemessungstabelle isoliert'!$H$6","v":{"v":5.5286599999999995,"d":"5.53 m"}},{"$f":"'Bemessungstabelle isoliert'!$P3*'Bemessungstabelle isoliert'!$H$2*'Bemessungstabelle isoliert'!$H$3*'Bemessungstabelle isoliert'!$H$4*'Bemessungstabelle isoliert'!$H$5*'Bemessungstabelle isoliert'!$H$6","v":{"v":6.549939999999999,"d":"6.55 m"}},{"$f":"'Bemessungstabelle isoliert'!$P4*'Bemessungstabelle isoliert'!$H$2*'Bemessungstabelle isoliert'!$H$3*'Bemessungstabelle isoliert'!$H$4*'Bemessungstabelle isoliert'!$H$5*'Bemessungstabelle isoliert'!$H$6","v":{"v":7.0213,"d":"7.02 m"}},{"$f":"'Bemessungstabelle isoliert'!$P5*'Bemessungstabelle isoliert'!$H$2*'Bemessungstabelle isoliert'!$H$3*'Bemessungstabelle isoliert'!$H$4*'Bemessungstabelle isoliert'!$H$5*'Bemessungstabelle isoliert'!$H$6","v":{"v":7.296259999999999,"d":"7.30 m"}},{"$f":"'Bemessungstabelle isoliert'!$P6*'Bemessungstabelle isoliert'!$H$2*'Bemessungstabelle isoliert'!$H$3*'Bemessungstabelle isoliert'!$H$4*'Bemessungstabelle isoliert'!$H$5*'Bemessungstabelle isoliert'!$H$6","v":{"v":2.32734,"d":"2.33 m"}},{"$f":"'Bemessungstabelle isoliert'!$P7*'Bemessungstabelle isoliert'!$H$2*'Bemessungstabelle isoliert'!$H$3*'Bemessungstabelle isoliert'!$H$4*'Bemessungstabelle isoliert'!$H$5*'Bemessungstabelle isoliert'!$H$6","v":{"v":2.4059,"d":"2.41 m"}},{"$f":"'Bemessungstabelle isoliert'!$P8*'Bemessungstabelle isoliert'!$H$2*'Bemessungstabelle isoliert'!$H$3*'Bemessungstabelle isoliert'!$H$4*'Bemessungstabelle isoliert'!$H$5*'Bemessungstabelle isoliert'!$H$6","v":{"v":3.40754,"d":"3.41 m"}},{"$f":"'Bemessungstabelle isoliert'!$P9*'Bemessungstabelle isoliert'!$H$2*'Bemessungstabelle isoliert'!$H$3*'Bemessungstabelle isoliert'!$H$4*'Bemessungstabelle isoliert'!$H$5*'Bemessungstabelle isoliert'!$H$6","v":{"v":3.96728,"d":"3.97 m"}},{"$f":"'Bemessungstabelle isoliert'!$P10*'Bemessungstabelle isoliert'!$H$2*'Bemessungstabelle isoliert'!$H$3*'Bemessungstabelle isoliert'!$H$4*'Bemessungstabelle isoliert'!$H$5*'Bemessungstabelle isoliert'!$H$6","v":{"v":4.34044,"d":"4.34 m"}},{"$f":"'Bemessungstabelle isoliert'!$P11*'Bemessungstabelle isoliert'!$H$2*'Bemessungstabelle isoliert'!$H$3*'Bemessungstabelle isoliert'!$H$4*'Bemessungstabelle isoliert'!$H$5*'Bemessungstabelle isoliert'!$H$6","v":{"v":5.057300000000001,"d":"5.06 m"}},{"$f":"'Bemessungstabelle isoliert'!$P12*'Bemessungstabelle isoliert'!$H$2*'Bemessungstabelle isoliert'!$H$3*'Bemessungstabelle isoliert'!$H$4*'Bemessungstabelle isoliert'!$H$5*'Bemessungstabelle isoliert'!$H$6","v":{"v":5.3519,"d":"5.35 m"}},{"$f":"'Bemessungstabelle isoliert'!#REF!*'Bemessungstabelle isoliert'!$H$2*'Bemessungstabelle isoliert'!$H$3*'Bemessungstabelle isoliert'!$H$4*'Bemessungstabelle isoliert'!$H$5*'Bemessungstabelle isoliert'!$H$6","v":{"$error":"#REF!"}},{"$f":"'Bemessungstabelle isoliert'!#REF!*'Bemessungstabelle isoliert'!$H$2*'Bemessungstabelle isoliert'!$H$3*'Bemessungstabelle isoliert'!$H$4*'Bemessungstabelle isoliert'!$H$5*'Bemessungstabelle isoliert'!$H$6","v":{"$error":"#REF!"}},{"$f":"'Bemessungstabelle isoliert'!#REF!*'Bemessungstabelle isoliert'!$H$2*'Bemessungstabelle isoliert'!$H$3*'Bemessungstabelle isoliert'!$H$4*'Bemessungstabelle isoliert'!$H$5*'Bemessungstabelle isoliert'!$H$6","v":{"$error":"#REF!"}},{"$f":"'Bemessungstabelle isoliert'!#REF!*'Bemessungstabelle isoliert'!$H$2*'Bemessungstabelle isoliert'!$H$3*'Bemessungstabelle isoliert'!$H$4*'Bemessungstabelle isoliert'!$H$5*'Bemessungstabelle isoliert'!$H$6","v":{"$error":"#REF!"}},null,{"v":2.5,"d":"2.50 m"},{"$f":"'Bemessungstabelle isoliert'!$T42*'Bemessungstabelle isoliert'!$H$42*'Bemessungstabelle isoliert'!$H$43*'Bemessungstabelle isoliert'!$H$44*'Bemessungstabelle isoliert'!$H$45*'Bemessungstabelle isoliert'!$H$46*'Bemessungstabelle isoliert'!#REF!*'Bemessungstabelle isoliert'!$H$47","v":{"$error":"#REF!"}},{"$f":"'Bemessungstabelle isoliert'!$T43*'Bemessungstabelle isoliert'!$H$42*'Bemessungstabelle isoliert'!$H$43*'Bemessungstabelle isoliert'!$H$44*'Bemessungstabelle isoliert'!$H$45*'Bemessungstabelle isoliert'!$H$46*'Bemessungstabelle isoliert'!#REF!*'Bemessungstabelle isoliert'!$H$47","v":{"$error":"#REF!"}},{"$f":"'Bemessungstabelle isoliert'!$T44*'Bemessungstabelle isoliert'!$H$42*'Bemessungstabelle isoliert'!$H$43*'Bemessungstabelle isoliert'!$H$44*'Bemessungstabelle isoliert'!$H$45*'Bemessungstabelle isoliert'!$H$46*'Bemessungstabelle isoliert'!#REF!*'Bemessungstabelle isoliert'!$H$47","v":{"$error":"#REF!"}},{"$f":"'Bemessungstabelle isoliert'!$T45*'Bemessungstabelle isoliert'!$H$42*'Bemessungstabelle isoliert'!$H$43*'Bemessungstabelle isoliert'!$H$44*'Bemessungstabelle isoliert'!$H$45*'Bemessungstabelle isoliert'!$H$46*'Bemessungstabelle isoliert'!#REF!*'Bemessungstabelle isoliert'!$H$47","v":{"$error":"#REF!"}},{"$f":"'Bemessungstabelle isoliert'!$T46*'Bemessungstabelle isoliert'!$H$42*'Bemessungstabelle isoliert'!$H$43*'Bemessungstabelle isoliert'!$H$44*'Bemessungstabelle isoliert'!$H$45*'Bemessungstabelle isoliert'!$H$46*'Bemessungstabelle isoliert'!#REF!*'Bemessungstabelle isoliert'!$H$47","v":{"$error":"#REF!"}},{"$f":"'Bemessungstabelle isoliert'!$T47*'Bemessungstabelle isoliert'!$H$42*'Bemessungstabelle isoliert'!$H$43*'Bemessungstabelle isoliert'!$H$44*'Bemessungstabelle isoliert'!$H$45*'Bemessungstabelle isoliert'!$H$46*'Bemessungstabelle isoliert'!#REF!*'Bemessungstabelle isoliert'!$H$47","v":{"$error":"#REF!"}},{"$f":"'Bemessungstabelle isoliert'!$T48*'Bemessungstabelle isoliert'!$H$42*'Bemessungstabelle isoliert'!$H$43*'Bemessungstabelle isoliert'!$H$44*'Bemessungstabelle isoliert'!$H$45*'Bemessungstabelle isoliert'!$H$46*'Bemessungstabelle isoliert'!#REF!*'Bemessungstabelle isoliert'!$H$47","v":{"$error":"#REF!"}},{"$f":"'Bemessungstabelle isoliert'!$T49*'Bemessungstabelle isoliert'!$H$42*'Bemessungstabelle isoliert'!$H$43*'Bemessungstabelle isoliert'!$H$44*'Bemessungstabelle isoliert'!$H$45*'Bemessungstabelle isoliert'!$H$46*'Bemessungstabelle isoliert'!#REF!*'Bemessungstabelle isoliert'!$H$47","v":{"$error":"#REF!"}},{"$f":"'Bemessungstabelle isoliert'!$T50*'Bemessungstabelle isoliert'!$H$42*'Bemessungstabelle isoliert'!$H$43*'Bemessungstabelle isoliert'!$H$44*'Bemessungstabelle isoliert'!$H$45*'Bemessungstabelle isoliert'!$H$46*'Bemessungstabelle isoliert'!#REF!*'Bemessungstabelle isoliert'!$H$47","v":{"$error":"#REF!"}},{"$f":"'Bemessungstabelle isoliert'!$T51*'Bemessungstabelle isoliert'!$H$42*'Bemessungstabelle isoliert'!$H$43*'Bemessungstabelle isoliert'!$H$44*'Bemessungstabelle isoliert'!$H$45*'Bemessungstabelle isoliert'!$H$46*'Bemessungstabelle isoliert'!#REF!*'Bemessungstabelle isoliert'!$H$47","v":{"$error":"#REF!"}},null,{"v":3.5,"d":"3.50 m"},{"$f":"('Bemessungstabelle unisoliert'!$P75+'Bemessungstabelle unisoliert'!R75)/2*'Bemessungstabelle unisoliert'!$H$66*'Bemessungstabelle unisoliert'!$H$67*'Bemessungstabelle unisoliert'!$H$68*'Bemessungstabelle unisoliert'!$H$69*'Bemessungstabelle unisoliert'!$H$70*'Bemessungstabelle unisoliert'!$H$71","v":{"v":2.5662606,"d":"2.57 m"}},{"$f":"('Bemessungstabelle unisoliert'!#REF!+'Bemessungstabelle unisoliert'!#REF!)/2*'Bemessungstabelle unisoliert'!$H$66*'Bemessungstabelle unisoliert'!$H$67*'Bemessungstabelle unisoliert'!$H$68*'Bemessungstabelle unisoliert'!$H$69*'Bemessungstabelle unisoliert'!$H$70*'Bemessungstabelle unisoliert'!$H$71","v":{"$error":"#REF!"}},{"$f":"('Bemessungstabelle unisoliert'!$P74+'Bemessungstabelle unisoliert'!R74)/2*'Bemessungstabelle unisoliert'!$H$66*'Bemessungstabelle unisoliert'!$H$67*'Bemessungstabelle unisoliert'!$H$68*'Bemessungstabelle unisoliert'!$H$69*'Bemessungstabelle unisoliert'!$H$70*'Bemessungstabelle unisoliert'!$H$71","v":{"v":6.164505,"d":"6.16 m"}},{"$f":"('Bemessungstabelle unisoliert'!#REF!+'Bemessungstabelle unisoliert'!#REF!)/2*'Bemessungstabelle unisoliert'!$H$66*'Bemessungstabelle unisoliert'!$H$67*'Bemessungstabelle unisoliert'!$H$68*'Bemessungstabelle unisoliert'!$H$69*'Bemessungstabelle unisoliert'!$H$70*'Bemessungstabelle unisoliert'!$H$71","v":{"$error":"#REF!"}},{"$f":"('Bemessungstabelle unisoliert'!$P76+'Bemessungstabelle unisoliert'!R76)/2*'Bemessungstabelle unisoliert'!$H$66*'Bemessungstabelle unisoliert'!$H$67*'Bemessungstabelle unisoliert'!$H$68*'Bemessungstabelle unisoliert'!$H$69*'Bemessungstabelle unisoliert'!$H$70*'Bemessungstabelle unisoliert'!$H$71","v":{"v":3.7534986,"d":"3.75 m"}}]
[null,{"v":0.7,"d":"0.70 m"},{"$f":"'Bemessungstabelle isoliert'!$R2*'Bemessungstabelle isoliert'!$H$2*'Bemessungstabelle isoliert'!$H$3*'Bemessungstabelle isoliert'!$H$4*'Bemessungstabelle isoliert'!$H$5*'Bemessungstabelle isoliert'!$H$6","v":{"v":5.253699999999999,"d":"5.25 m"}},{"$f":"'Bemessungstabelle isoliert'!$R3*'Bemessungstabelle isoliert'!$H$2*'Bemessungstabelle isoliert'!$H$3*'Bemessungstabelle isoliert'!$H$4*'Bemessungstabelle isoliert'!$H$5*'Bemessungstabelle isoliert'!$H$6","v":{"v":6.26516,"d":"6.27 m"}},{"$f":"'Bemessungstabelle isoliert'!$R4*'Bemessungstabelle isoliert'!$H$2*'Bemessungstabelle isoliert'!$H$3*'Bemessungstabelle isoliert'!$H$4*'Bemessungstabelle isoliert'!$H$5*'Bemessungstabelle isoliert'!$H$6","v":{"v":6.71688,"d":"6.72 m"}},{"$f":"'Bemessungstabelle isoliert'!$R5*'Bemessungstabelle isoliert'!$H$2*'Bemessungstabelle isoliert'!$H$3*'Bemessungstabelle isoliert'!$H$4*'Bemessungstabelle isoliert'!$H$5*'Bemessungstabelle isoliert'!$H$6","v":{"v":6.98202,"d":"6.98 m"}},{"$f":"'Bemessungstabelle isoliert'!$R6*'Bemessungstabelle isoliert'!$H$2*'Bemessungstabelle isoliert'!$H$3*'Bemessungstabelle isoliert'!$H$4*'Bemessungstabelle isoliert'!$H$5*'Bemessungstabelle isoliert'!$H$6","v":{"v":2.18986,"d":"2.19 m"}},{"$f":"'Bemessungstabelle isoliert'!$R7*'Bemessungstabelle isoliert'!$H$2*'Bemessungstabelle isoliert'!$H$3*'Bemessungstabelle isoliert'!$H$4*'Bemessungstabelle isoliert'!$H$5*'Bemessungstabelle isoliert'!$H$6","v":{"v":2.28806,"d":"2.29 m"}},{"$f":"'Bemessungstabelle isoliert'!$R8*'Bemessungstabelle isoliert'!$H$2*'Bemessungstabelle isoliert'!$H$3*'Bemessungstabelle isoliert'!$H$4*'Bemessungstabelle isoliert'!$H$5*'Bemessungstabelle isoliert'!$H$6","v":{"v":3.2307799999999998,"d":"3.23 m"}},{"$f":"'Bemessungstabelle isoliert'!$R9*'Bemessungstabelle isoliert'!$H$2*'Bemessungstabelle isoliert'!$H$3*'Bemessungstabelle isoliert'!$H$4*'Bemessungstabelle isoliert'!$H$5*'Bemessungstabelle isoliert'!$H$6","v":{"v":3.7807,"d":"3.78 m"}},{"$f":"'Bemessungstabelle isoliert'!$R10*'Bemessungstabelle isoliert'!$H$2*'Bemessungstabelle isoliert'!$H$3*'Bemessungstabelle isoliert'!$H$4*'Bemessungstabelle isoliert'!$H$5*'Bemessungstabelle isoliert'!$H$6","v":{"v":4.1244000000000005,"d":"4.12 m"}},{"$f":"'Bemessungstabelle isoliert'!$R11*'Bemessungstabelle isoliert'!$H$2*'Bemessungstabelle isoliert'!$H$3*'Bemessungstabelle isoliert'!$H$4*'Bemessungstabelle isoliert'!$H$5*'Bemessungstabelle isoliert'!$H$6","v":{"v":4.83144,"d":"4.83 m"}},{"$f":"'Bemessungstabelle isoliert'!$R12*'Bemessungstabelle isoliert'!$H$2*'Bemessungstabelle isoliert'!$H$3*'Bemessungstabelle isoliert'!$H$4*'Bemessungstabelle isoliert'!$H$5*'Bemessungstabelle isoliert'!$H$6","v":{"v":5.12604,"d":"5.13 m"}},{"$f":"'Bemessungstabelle isoliert'!#REF!*'Bemessungstabelle isoliert'!$H$2*'Bemessungstabelle isoliert'!$H$3*'Bemessungstabelle isoliert'!$H$4*'Bemessungstabelle isoliert'!$H$5*'Bemessungstabelle isoliert'!$H$6","v":{"$error":"#REF!"}},{"$f":"'Bemessungstabelle isoliert'!#REF!*'Bemessungstabelle isoliert'!$H$2*'Bemessungstabelle isoliert'!$H$3*'Bemessungstabelle isoliert'!$H$4*'Bemessungstabelle isoliert'!$H$5*'Bemessungstabelle isoliert'!$H$6","v":{"$error":"#REF!"}},{"$f":"'Bemessungstabelle isoliert'!#REF!*'Bemessungstabelle isoliert'!$H$2*'Bemessungstabelle isoliert'!$H$3*'Bemessungstabelle isoliert'!$H$4*'Bemessungstabelle isoliert'!$H$5*'Bemessungstabelle isoliert'!$H$6","v":{"$error":"#REF!"}},{"$f":"'Bemessungstabelle isoliert'!#REF!*'Bemessungstabelle isoliert'!$H$2*'Bemessungstabelle isoliert'!$H$3*'Bemessungstabelle isoliert'!$H$4*'Bemessungstabelle isoliert'!$H$5*'Bemessungstabelle isoliert'!$H$6","v":{"$error":"#REF!"}},null,{"v":3,"d":"3.00 m"},{"$f":"'Bemessungstabelle isoliert'!$V42*'Bemessungstabelle isoliert'!$H$42*'Bemessungstabelle isoliert'!$H$43*'Bemessungstabelle isoliert'!$H$44*'Bemessungstabelle isoliert'!$H$45*'Bemessungstabelle isoliert'!$H$46*'Bemessungstabelle isoliert'!#REF!*'Bemessungstabelle isoliert'!$H$47","v":{"$error":"#REF!"}},{"$f":"'Bemessungstabelle isoliert'!$V43*'Bemessungstabelle isoliert'!$H$42*'Bemessungstabelle isoliert'!$H$43*'Bemessungstabelle isoliert'!$H$44*'Bemessungstabelle isoliert'!$H$45*'Bemessungstabelle isoliert'!$H$46*'Bemessungstabelle isoliert'!#REF!*'Bemessungstabelle isoliert'!$H$47","v":{"$error":"#REF!"}},{"$f":"'Bemessungstabelle isoliert'!$V44*'Bemessungstabelle isoliert'!$H$42*'Bemessungstabelle isoliert'!$H$43*'Bemessungstabelle isoliert'!$H$44*'Bemessungstabelle isoliert'!$H$45*'Bemessungstabelle isoliert'!$H$46*'Bemessungstabelle isoliert'!#REF!*'Bemessungstabelle isoliert'!$H$47","v":{"$error":"#REF!"}},{"$f":"'Bemessungstabelle isoliert'!$V45*'Bemessungstabelle isoliert'!$H$42*'Bemessungstabelle isoliert'!$H$43*'Bemessungstabelle isoliert'!$H$44*'Bemessungstabelle isoliert'!$H$45*'Bemessungstabelle isoliert'!$H$46*'Bemessungstabelle isoliert'!#REF!*'Bemessungstabelle isoliert'!$H$47","v":{"$error":"#REF!"}},{"$f":"'Bemessungstabelle isoliert'!$V46*'Bemessungstabelle isoliert'!$H$42*'Bemessungstabelle isoliert'!$H$43*'Bemessungstabelle isoliert'!$H$44*'Bemessungstabelle isoliert'!$H$45*'Bemessungstabelle isoliert'!$H$46*'Bemessungstabelle isoliert'!#REF!*'Bemessungstabelle isoliert'!$H$47","v":{"$error":"#REF!"}},{"$f":"'Bemessungstabelle isoliert'!$V47*'Bemessungstabelle isoliert'!$H$42*'Bemessungstabelle isoliert'!$H$43*'Bemessungstabelle isoliert'!$H$44*'Bemessungstabelle isoliert'!$H$45*'Bemessungstabelle isoliert'!$H$46*'Bemessungstabelle isoliert'!#REF!*'Bemessungstabelle isoliert'!$H$47","v":{"$error":"#REF!"}},{"$f":"'Bemessungstabelle isoliert'!$V48*'Bemessungstabelle isoliert'!$H$42*'Bemessungstabelle isoliert'!$H$43*'Bemessungstabelle isoliert'!$H$44*'Bemessungstabelle isoliert'!$H$45*'Bemessungstabelle isoliert'!$H$46*'Bemessungstabelle isoliert'!#REF!*'Bemessungstabelle isoliert'!$H$47","v":{"$error":"#REF!"}},{"$f":"'Bemessungstabelle isoliert'!$V49*'Bemessungstabelle isoliert'!$H$42*'Bemessungstabelle isoliert'!$H$43*'Bemessungstabelle isoliert'!$H$44*'Bemessungstabelle isoliert'!$H$45*'Bemessungstabelle isoliert'!$H$46*'Bemessungstabelle isoliert'!#REF!*'Bemessungstabelle isoliert'!$H$47","v":{"$error":"#REF!"}},{"$f":"'Bemessungstabelle isoliert'!$V50*'Bemessungstabelle isoliert'!$H$42*'Bemessungstabelle isoliert'!$H$43*'Bemessungstabelle isoliert'!$H$44*'Bemessungstabelle isoliert'!$H$45*'Bemessungstabelle isoliert'!$H$46*'Bemessungstabelle isoliert'!#REF!*'Bemessungstabelle isoliert'!$H$47","v":{"$error":"#REF!"}},{"$f":"'Bemessungstabelle isoliert'!$V51*'Bemessungstabelle isoliert'!$H$42*'Bemessungstabelle isoliert'!$H$43*'Bemessungstabelle isoliert'!$H$44*'Bemessungstabelle isoliert'!$H$45*'Bemessungstabelle isoliert'!$H$46*'Bemessungstabelle isoliert'!#REF!*'Bemessungstabelle isoliert'!$H$47","v":{"$error":"#REF!"}},null,{"v":4,"d":"4.00 m"},{"$f":"'Bemessungstabelle unisoliert'!$R75*'Bemessungstabelle unisoliert'!$H$66*'Bemessungstabelle unisoliert'!$H$67*'Bemessungstabelle unisoliert'!$H$68*'Bemessungstabelle unisoliert'!$H$69*'Bemessungstabelle unisoliert'!$H$70*'Bemessungstabelle unisoliert'!$H$71","v":{"v":2.4475368000000004,"d":"2.45 m"}},{"$f":"'Bemessungstabelle unisoliert'!#REF!*'Bemessungstabelle unisoliert'!$H$66*'Bemessungstabelle unisoliert'!$H$67*'Bemessungstabelle unisoliert'!$H$68*'Bemessungstabelle unisoliert'!$H$69*'Bemessungstabelle unisoliert'!$H$70*'Bemessungstabelle unisoliert'!$H$71","v":{"$error":"#REF!"}},{"$f":"'Bemessungstabelle unisoliert'!$R74*'Bemessungstabelle unisoliert'!$H$66*'Bemessungstabelle unisoliert'!$H$67*'Bemessungstabelle unisoliert'!$H$68*'Bemessungstabelle unisoliert'!$H$69*'Bemessungstabelle unisoliert'!$H$70*'Bemessungstabelle unisoliert'!$H$71","v":{"v":5.8905270000000005,"d":"5.89 m"}},{"$f":"'Bemessungstabelle unisoliert'!#REF!*'Bemessungstabelle unisoliert'!$H$66*'Bemessungstabelle unisoliert'!$H$67*'Bemessungstabelle unisoliert'!$H$68*'Bemessungstabelle unisoliert'!$H$69*'Bemessungstabelle unisoliert'!$H$70*'Bemessungstabelle unisoliert'!$H$71","v":{"$error":"#REF!"}},{"$f":"'Bemessungstabelle unisoliert'!$R76*'Bemessungstabelle unisoliert'!$H$66*'Bemessungstabelle unisoliert'!$H$67*'Bemessungstabelle unisoliert'!$H$68*'Bemessungstabelle unisoliert'!$H$69*'Bemessungstabelle unisoliert'!$H$70*'Bemessungstabelle unisoliert'!$H$71","v":{"v":3.5799792000000004,"d":"3.58 m"}}]
[null,{"v":0.8,"d":"0.80 m"},{"$f":"'Bemessungstabelle isoliert'!$T2*'Bemessungstabelle isoliert'!$H$2*'Bemessungstabelle isoliert'!$H$3*'Bemessungstabelle isoliert'!$H$4*'Bemessungstabelle isoliert'!$H$5*'Bemessungstabelle isoliert'!$H$6","v":{"v":5.02784,"d":"5.03 m"}},{"$f":"'Bemessungstabelle isoliert'!$T3*'Bemessungstabelle isoliert'!$H$2*'Bemessungstabelle isoliert'!$H$3*'Bemessungstabelle isoliert'!$H$4*'Bemessungstabelle isoliert'!$H$5*'Bemessungstabelle isoliert'!$H$6","v":{"v":6.01966,"d":"6.02 m"}},{"$f":"'Bemessungstabelle isoliert'!$T4*'Bemessungstabelle isoliert'!$H$2*'Bemessungstabelle isoliert'!$H$3*'Bemessungstabelle isoliert'!$H$4*'Bemessungstabelle isoliert'!$H$5*'Bemessungstabelle isoliert'!$H$6","v":{"v":6.47138,"d":"6.47 m"}},{"$f":"'Bemessungstabelle isoliert'!$T5*'Bemessungstabelle isoliert'!$H$2*'Bemessungstabelle isoliert'!$H$3*'Bemessungstabelle isoliert'!$H$4*'Bemessungstabelle isoliert'!$H$5*'Bemessungstabelle isoliert'!$H$6","v":{"v":6.71688,"d":"6.72 m"}},{"$f":"'Bemessungstabelle isoliert'!$T6*'Bemessungstabelle isoliert'!$H$2*'Bemessungstabelle isoliert'!$H$3*'Bemessungstabelle isoliert'!$H$4*'Bemessungstabelle isoliert'!$H$5*'Bemessungstabelle isoliert'!$H$6","v":{"v":2.09166,"d":"2.09 m"}},{"$f":"'Bemessungstabelle isoliert'!$T7*'Bemessungstabelle isoliert'!$H$2*'Bemessungstabelle isoliert'!$H$3*'Bemessungstabelle isoliert'!$H$4*'Bemessungstabelle isoliert'!$H$5*'Bemessungstabelle isoliert'!$H$6","v":{"v":2.18986,"d":"2.19 m"}},{"$f":"'Bemessungstabelle isoliert'!$T8*'Bemessungstabelle isoliert'!$H$2*'Bemessungstabelle isoliert'!$H$3*'Bemessungstabelle isoliert'!$H$4*'Bemessungstabelle isoliert'!$H$5*'Bemessungstabelle isoliert'!$H$6","v":{"v":3.08348,"d":"3.08 m"}},{"$f":"'Bemessungstabelle isoliert'!$T9*'Bemessungstabelle isoliert'!$H$2*'Bemessungstabelle isoliert'!$H$3*'Bemessungstabelle isoliert'!$H$4*'Bemessungstabelle isoliert'!$H$5*'Bemessungstabelle isoliert'!$H$6","v":{"v":3.6334,"d":"3.63 m"}},{"$f":"'Bemessungstabelle isoliert'!$T10*'Bemessungstabelle isoliert'!$H$2*'Bemessungstabelle isoliert'!$H$3*'Bemessungstabelle isoliert'!$H$4*'Bemessungstabelle isoliert'!$H$5*'Bemessungstabelle isoliert'!$H$6","v":{"v":3.93782,"d":"3.94 m"}},{"$f":"'Bemessungstabelle isoliert'!$T11*'Bemessungstabelle isoliert'!$H$2*'Bemessungstabelle isoliert'!$H$3*'Bemessungstabelle isoliert'!$H$4*'Bemessungstabelle isoliert'!$H$5*'Bemessungstabelle isoliert'!$H$6","v":{"v":4.63504,"d":"4.64 m"}},{"$f":"'Bemessungstabelle isoliert'!$T12*'Bemessungstabelle isoliert'!$H$2*'Bemessungstabelle isoliert'!$H$3*'Bemessungstabelle isoliert'!$H$4*'Bemessungstabelle isoliert'!$H$5*'Bemessungstabelle isoliert'!$H$6","v":{"v":4.929639999999999,"d":"4.93 m"}},{"$f":"'Bemessungstabelle isoliert'!#REF!*'Bemessungstabelle isoliert'!$H$2*'Bemessungstabelle isoliert'!$H$3*'Bemessungstabelle isoliert'!$H$4*'Bemessungstabelle isoliert'!$H$5*'Bemessungstabelle isoliert'!$H$6","v":{"$error":"#REF!"}},{"$f":"'Bemessungstabelle isoliert'!#REF!*'Bemessungstabelle isoliert'!$H$2*'Bemessungstabelle isoliert'!$H$3*'Bemessungstabelle isoliert'!$H$4*'Bemessungstabelle isoliert'!$H$5*'Bemessungstabelle isoliert'!$H$6","v":{"$error":"#REF!"}},{"$f":"'Bemessungstabelle isoliert'!#REF!*'Bemessungstabelle isoliert'!$H$2*'Bemessungstabelle isoliert'!$H$3*'Bemessungstabelle isoliert'!$H$4*'Bemessungstabelle isoliert'!$H$5*'Bemessungstabelle isoliert'!$H$6","v":{"$error":"#REF!"}},{"$f":"'Bemessungstabelle isoliert'!#REF!*'Bemessungstabelle isoliert'!$H$2*'Bemessungstabelle isoliert'!$H$3*'Bemessungstabelle isoliert'!$H$4*'Bemessungstabelle isoliert'!$H$5*'Bemessungstabelle isoliert'!$H$6","v":{"$error":"#REF!"}},null,{"v":3.5,"d":"3.50 m"},{"$f":"'Bemessungstabelle isoliert'!$X42*'Bemessungstabelle isoliert'!$H$42*'Bemessungstabelle isoliert'!$H$43*'Bemessungstabelle isoliert'!$H$44*'Bemessungstabelle isoliert'!$H$45*'Bemessungstabelle isoliert'!$H$46*'Bemessungstabelle isoliert'!#REF!*'Bemessungstabelle isoliert'!$H$47","v":{"$error":"#REF!"}},{"$f":"'Bemessungstabelle isoliert'!$X43*'Bemessungstabelle isoliert'!$H$42*'Bemessungstabelle isoliert'!$H$43*'Bemessungstabelle isoliert'!$H$44*'Bemessungstabelle isoliert'!$H$45*'Bemessungstabelle isoliert'!$H$46*'Bemessungstabelle isoliert'!#REF!*'Bemessungstabelle isoliert'!$H$47","v":{"$error":"#REF!"}},{"$f":"'Bemessungstabelle isoliert'!$X44*'Bemessungstabelle isoliert'!$H$42*'Bemessungstabelle isoliert'!$H$43*'Bemessungstabelle isoliert'!$H$44*'Bemessungstabelle isoliert'!$H$45*'Bemessungstabelle isoliert'!$H$46*'Bemessungstabelle isoliert'!#REF!*'Bemessungstabelle isoliert'!$H$47","v":{"$error":"#REF!"}},{"$f":"'Bemessungstabelle isoliert'!$X45*'Bemessungstabelle isoliert'!$H$42*'Bemessungstabelle isoliert'!$H$43*'Bemessungstabelle isoliert'!$H$44*'Bemessungstabelle isoliert'!$H$45*'Bemessungstabelle isoliert'!$H$46*'Bemessungstabelle isoliert'!#REF!*'Bemessungstabelle isoliert'!$H$47","v":{"$error":"#REF!"}},{"$f":"'Bemessungstabelle isoliert'!$X46*'Bemessungstabelle isoliert'!$H$42*'Bemessungstabelle isoliert'!$H$43*'Bemessungstabelle isoliert'!$H$44*'Bemessungstabelle isoliert'!$H$45*'Bemessungstabelle isoliert'!$H$46*'Bemessungstabelle isoliert'!#REF!*'Bemessungstabelle isoliert'!$H$47","v":{"$error":"#REF!"}},{"$f":"'Bemessungstabelle isoliert'!$X47*'Bemessungstabelle isoliert'!$H$42*'Bemessungstabelle isoliert'!$H$43*'Bemessungstabelle isoliert'!$H$44*'Bemessungstabelle isoliert'!$H$45*'Bemessungstabelle isoliert'!$H$46*'Bemessungstabelle isoliert'!#REF!*'Bemessungstabelle isoliert'!$H$47","v":{"$error":"#REF!"}},{"$f":"'Bemessungstabelle isoliert'!$X48*'Bemessungstabelle isoliert'!$H$42*'Bemessungstabelle isoliert'!$H$43*'Bemessungstabelle isoliert'!$H$44*'Bemessungstabelle isoliert'!$H$45*'Bemessungstabelle isoliert'!$H$46*'Bemessungstabelle isoliert'!#REF!*'Bemessungstabelle isoliert'!$H$47","v":{"$error":"#REF!"}},{"$f":"'Bemessungstabelle isoliert'!$X49*'Bemessungstabelle isoliert'!$H$42*'Bemessungstabelle isoliert'!$H$43*'Bemessungstabelle isoliert'!$H$44*'Bemessungstabelle isoliert'!$H$45*'Bemessungstabelle isoliert'!$H$46*'Bemessungstabelle isoliert'!#REF!*'Bemessungstabelle isoliert'!$H$47","v":{"$error":"#REF!"}},{"$f":"'Bemessungstabelle isoliert'!$X50*'Bemessungstabelle isoliert'!$H$42*'Bemessungstabelle isoliert'!$H$43*'Bemessungstabelle isoliert'!$H$44*'Bemessungstabelle isoliert'!$H$45*'Bemessungstabelle isoliert'!$H$46*'Bemessungstabelle isoliert'!#REF!*'Bemessungstabelle isoliert'!$H$47","v":{"$error":"#REF!"}},{"$f":"'Bemessungstabelle isoliert'!$X51*'Bemessungstabelle isoliert'!$H$42*'Bemessungstabelle isoliert'!$H$43*'Bemessungstabelle isoliert'!$H$44*'Bemessungstabelle isoliert'!$H$45*'Bemessungstabelle isoliert'!$H$46*'Bemessungstabelle isoliert'!#REF!*'Bemessungstabelle isoliert'!$H$47","v":{"$error":"#REF!"}},null,{"v":4.5,"d":"4.50 m"},{"$f":"('Bemessungstabelle unisoliert'!$R75+'Bemessungstabelle unisoliert'!T75)/2*'Bemessungstabelle unisoliert'!$H$66*'Bemessungstabelle unisoliert'!$H$67*'Bemessungstabelle unisoliert'!$H$68*'Bemessungstabelle unisoliert'!$H$69*'Bemessungstabelle unisoliert'!$H$70*'Bemessungstabelle unisoliert'!$H$71","v":{"v":2.3607771,"d":"2.36 m"}},{"$f":"('Bemessungstabelle unisoliert'!#REF!+'Bemessungstabelle unisoliert'!#REF!)/2*'Bemessungstabelle unisoliert'!$H$66*'Bemessungstabelle unisoliert'!$H$67*'Bemessungstabelle unisoliert'!$H$68*'Bemessungstabelle unisoliert'!$H$69*'Bemessungstabelle unisoliert'!$H$70*'Bemessungstabelle unisoliert'!$H$71","v":{"$error":"#REF!"}},{"$f":"('Bemessungstabelle unisoliert'!$R74+'Bemessungstabelle unisoliert'!T74)/2*'Bemessungstabelle unisoliert'!$H$66*'Bemessungstabelle unisoliert'!$H$67*'Bemessungstabelle unisoliert'!$H$68*'Bemessungstabelle unisoliert'!$H$69*'Bemessungstabelle unisoliert'!$H$70*'Bemessungstabelle unisoliert'!$H$71","v":{"v":5.6896098,"d":"5.69 m"}},{"$f":"('Bemessungstabelle unisoliert'!#REF!+'Bemessungstabelle unisoliert'!#REF!)/2*'Bemessungstabelle unisoliert'!$H$66*'Bemessungstabelle unisoliert'!$H$67*'Bemessungstabelle unisoliert'!$H$68*'Bemessungstabelle unisoliert'!$H$69*'Bemessungstabelle unisoliert'!$H$70*'Bemessungstabelle unisoliert'!$H$71","v":{"$error":"#REF!"}},{"$f":"('Bemessungstabelle unisoliert'!$R76+'Bemessungstabelle unisoliert'!T76)/2*'Bemessungstabelle unisoliert'!$H$66*'Bemessungstabelle unisoliert'!$H$67*'Bemessungstabelle unisoliert'!$H$68*'Bemessungstabelle unisoliert'!$H$69*'Bemessungstabelle unisoliert'!$H$70*'Bemessungstabelle unisoliert'!$H$71","v":{"v":3.4521228000000006,"d":"3.45 m"}}]
[null,{"v":0.9,"d":"0.90 m"},{"$f":"'Bemessungstabelle isoliert'!$V2*'Bemessungstabelle isoliert'!$H$2*'Bemessungstabelle isoliert'!$H$3*'Bemessungstabelle isoliert'!$H$4*'Bemessungstabelle isoliert'!$H$5*'Bemessungstabelle isoliert'!$H$6","v":{"v":4.841259999999999,"d":"4.84 m"}},{"$f":"'Bemessungstabelle isoliert'!$V3*'Bemessungstabelle isoliert'!$H$2*'Bemessungstabelle isoliert'!$H$3*'Bemessungstabelle isoliert'!$H$4*'Bemessungstabelle isoliert'!$H$5*'Bemessungstabelle isoliert'!$H$6","v":{"v":5.8036200000000004,"d":"5.80 m"}},{"$f":"'Bemessungstabelle isoliert'!$V4*'Bemessungstabelle isoliert'!$H$2*'Bemessungstabelle isoliert'!$H$3*'Bemessungstabelle isoliert'!$H$4*'Bemessungstabelle isoliert'!$H$5*'Bemessungstabelle isoliert'!$H$6","v":{"v":6.24552,"d":"6.25 m"}},{"$f":"'Bemessungstabelle isoliert'!$V5*'Bemessungstabelle isoliert'!$H$2*'Bemessungstabelle isoliert'!$H$3*'Bemessungstabelle isoliert'!$H$4*'Bemessungstabelle isoliert'!$H$5*'Bemessungstabelle isoliert'!$H$6","v":{"v":6.49102,"d":"6.49 m"}},{"$f":"'Bemessungstabelle isoliert'!$V6*'Bemessungstabelle isoliert'!$H$2*'Bemessungstabelle isoliert'!$H$3*'Bemessungstabelle isoliert'!$H$4*'Bemessungstabelle isoliert'!$H$5*'Bemessungstabelle isoliert'!$H$6","v":{"v":2.00328,"d":"2.00 m"}},{"$f":"'Bemessungstabelle isoliert'!$V7*'Bemessungstabelle isoliert'!$H$2*'Bemessungstabelle isoliert'!$H$3*'Bemessungstabelle isoliert'!$H$4*'Bemessungstabelle isoliert'!$H$5*'Bemessungstabelle isoliert'!$H$6","v":{"v":2.1113,"d":"2.11 m"}},{"$f":"'Bemessungstabelle isoliert'!$V8*'Bemessungstabelle isoliert'!$H$2*'Bemessungstabelle isoliert'!$H$3*'Bemessungstabelle isoliert'!$H$4*'Bemessungstabelle isoliert'!$H$5*'Bemessungstabelle isoliert'!$H$6","v":{"v":2.9558199999999997,"d":"2.96 m"}},{"$f":"'Bemessungstabelle isoliert'!$V9*'Bemessungstabelle isoliert'!$H$2*'Bemessungstabelle isoliert'!$H$3*'Bemessungstabelle isoliert'!$H$4*'Bemessungstabelle isoliert'!$H$5*'Bemessungstabelle isoliert'!$H$6","v":{"v":3.49592,"d":"3.50 m"}},{"$f":"'Bemessungstabelle isoliert'!$V10*'Bemessungstabelle isoliert'!$H$2*'Bemessungstabelle isoliert'!$H$3*'Bemessungstabelle isoliert'!$H$4*'Bemessungstabelle isoliert'!$H$5*'Bemessungstabelle isoliert'!$H$6","v":{"v":3.7807,"d":"3.78 m"}},{"$f":"'Bemessungstabelle isoliert'!$V11*'Bemessungstabelle isoliert'!$H$2*'Bemessungstabelle isoliert'!$H$3*'Bemessungstabelle isoliert'!$H$4*'Bemessungstabelle isoliert'!$H$5*'Bemessungstabelle isoliert'!$H$6","v":{"v":4.4681,"d":"4.47 m"}},{"$f":"'Bemessungstabelle isoliert'!$V12*'Bemessungstabelle isoliert'!$H$2*'Bemessungstabelle isoliert'!$H$3*'Bemessungstabelle isoliert'!$H$4*'Bemessungstabelle isoliert'!$H$5*'Bemessungstabelle isoliert'!$H$6","v":{"v":4.75288,"d":"4.75 m"}},{"$f":"'Bemessungstabelle isoliert'!#REF!*'Bemessungstabelle isoliert'!$H$2*'Bemessungstabelle isoliert'!$H$3*'Bemessungstabelle isoliert'!$H$4*'Bemessungstabelle isoliert'!$H$5*'Bemessungstabelle isoliert'!$H$6","v":{"$error":"#REF!"}},{"$f":"'Bemessungstabelle isoliert'!#REF!*'Bemessungstabelle isoliert'!$H$2*'Bemessungstabelle isoliert'!$H$3*'Bemessungstabelle isoliert'!$H$4*'Bemessungstabelle isoliert'!$H$5*'Bemessungstabelle isoliert'!$H$6","v":{"$error":"#REF!"}},{"$f":"'Bemessungstabelle isoliert'!#REF!*'Bemessungstabelle isoliert'!$H$2*'Bemessungstabelle isoliert'!$H$3*'Bemessungstabelle isoliert'!$H$4*'Bemessungstabelle isoliert'!$H$5*'Bemessungstabelle isoliert'!$H$6","v":{"$error":"#REF!"}},{"$f":"'Bemessungstabelle isoliert'!#REF!*'Bemessungstabelle isoliert'!$H$2*'Bemessungstabelle isoliert'!$H$3*'Bemessungstabelle isoliert'!$H$4*'Bemessungstabelle isoliert'!$H$5*'Bemessungstabelle isoliert'!$H$6","v":{"$error":"#REF!"}},null,{"v":4,"d":"4.00 m"},{"$f":"'Bemessungstabelle isoliert'!$Z42*'Bemessungstabelle isoliert'!$H$42*'Bemessungstabelle isoliert'!$H$43*'Bemessungstabelle isoliert'!$H$44*'Bemessungstabelle isoliert'!$H$45*'Bemessungstabelle isoliert'!$H$46*'Bemessungstabelle isoliert'!#REF!*'Bemessungstabelle isoliert'!$H$47","v":{"$error":"#REF!"}},{"$f":"'Bemessungstabelle isoliert'!$Z43*'Bemessungstabelle isoliert'!$H$42*'Bemessungstabelle isoliert'!$H$43*'Bemessungstabelle isoliert'!$H$44*'Bemessungstabelle isoliert'!$H$45*'Bemessungstabelle isoliert'!$H$46*'Bemessungstabelle isoliert'!#REF!*'Bemessungstabelle isoliert'!$H$47","v":{"$error":"#REF!"}},{"$f":"'Bemessungstabelle isoliert'!$Z44*'Bemessungstabelle isoliert'!$H$42*'Bemessungstabelle isoliert'!$H$43*'Bemessungstabelle isoliert'!$H$44*'Bemessungstabelle isoliert'!$H$45*'Bemessungstabelle isoliert'!$H$46*'Bemessungstabelle isoliert'!#REF!*'Bemessungstabelle isoliert'!$H$47","v":{"$error":"#REF!"}},{"$f":"'Bemessungstabelle isoliert'!$Z45*'Bemessungstabelle isoliert'!$H$42*'Bemessungstabelle isoliert'!$H$43*'Bemessungstabelle isoliert'!$H$44*'Bemessungstabelle isoliert'!$H$45*'Bemessungstabelle isoliert'!$H$46*'Bemessungstabelle isoliert'!#REF!*'Bemessungstabelle isoliert'!$H$47","v":{"$error":"#REF!"}},{"$f":"'Bemessungstabelle isoliert'!$Z46*'Bemessungstabelle isoliert'!$H$42*'Bemessungstabelle isoliert'!$H$43*'Bemessungstabelle isoliert'!$H$44*'Bemessungstabelle isoliert'!$H$45*'Bemessungstabelle isoliert'!$H$46*'Bemessungstabelle isoliert'!#REF!*'Bemessungstabelle isoliert'!$H$47","v":{"$error":"#REF!"}},{"$f":"'Bemessungstabelle isoliert'!$Z47*'Bemessungstabelle isoliert'!$H$42*'Bemessungstabelle isoliert'!$H$43*'Bemessungstabelle isoliert'!$H$44*'Bemessungstabelle isoliert'!$H$45*'Bemessungstabelle isoliert'!$H$46*'Bemessungstabelle isoliert'!#REF!*'Bemessungstabelle isoliert'!$H$47","v":{"$error":"#REF!"}},{"$f":"'Bemessungstabelle isoliert'!$Z48*'Bemessungstabelle isoliert'!$H$42*'Bemessungstabelle isoliert'!$H$43*'Bemessungstabelle isoliert'!$H$44*'Bemessungstabelle isoliert'!$H$45*'Bemessungstabelle isoliert'!$H$46*'Bemessungstabelle isoliert'!#REF!*'Bemessungstabelle isoliert'!$H$47","v":{"$error":"#REF!"}},{"$f":"'Bemessungstabelle isoliert'!$Z49*'Bemessungstabelle isoliert'!$H$42*'Bemessungstabelle isoliert'!$H$43*'Bemessungstabelle isoliert'!$H$44*'Bemessungstabelle isoliert'!$H$45*'Bemessungstabelle isoliert'!$H$46*'Bemessungstabelle isoliert'!#REF!*'Bemessungstabelle isoliert'!$H$47","v":{"$error":"#REF!"}},{"$f":"'Bemessungstabelle isoliert'!$Z50*'Bemessungstabelle isoliert'!$H$42*'Bemessungstabelle isoliert'!$H$43*'Bemessungstabelle isoliert'!$H$44*'Bemessungstabelle isoliert'!$H$45*'Bemessungstabelle isoliert'!$H$46*'Bemessungstabelle isoliert'!#REF!*'Bemessungstabelle isoliert'!$H$47","v":{"$error":"#REF!"}},{"$f":"'Bemessungstabelle isoliert'!$Z51*'Bemessungstabelle isoliert'!$H$42*'Bemessungstabelle isoliert'!$H$43*'Bemessungstabelle isoliert'!$H$44*'Bemessungstabelle isoliert'!$H$45*'Bemessungstabelle isoliert'!$H$46*'Bemessungstabelle isoliert'!#REF!*'Bemessungstabelle isoliert'!$H$47","v":{"$error":"#REF!"}},null,{"v":5,"d":"5.00 m"},{"$f":"'Bemessungstabelle unisoliert'!$T75*'Bemessungstabelle unisoliert'!$H$66*'Bemessungstabelle unisoliert'!$H$67*'Bemessungstabelle unisoliert'!$H$68*'Bemessungstabelle unisoliert'!$H$69*'Bemessungstabelle unisoliert'!$H$70*'Bemessungstabelle unisoliert'!$H$71","v":{"v":2.2740174000000004,"d":"2.27 m"}},{"$f":"'Bemessungstabelle unisoliert'!#REF!*'Bemessungstabelle unisoliert'!$H$66*'Bemessungstabelle unisoliert'!$H$67*'Bemessungstabelle unisoliert'!$H$68*'Bemessungstabelle unisoliert'!$H$69*'Bemessungstabelle unisoliert'!$H$70*'Bemessungstabelle unisoliert'!$H$71","v":{"$error":"#REF!"}},{"$f":"'Bemessungstabelle unisoliert'!$T74*'Bemessungstabelle unisoliert'!$H$66*'Bemessungstabelle unisoliert'!$H$67*'Bemessungstabelle unisoliert'!$H$68*'Bemessungstabelle unisoliert'!$H$69*'Bemessungstabelle unisoliert'!$H$70*'Bemessungstabelle unisoliert'!$H$71","v":{"v":5.4886926,"d":"5.49 m"}},{"$f":"'Bemessungstabelle unisoliert'!#REF!*'Bemessungstabelle unisoliert'!$H$66*'Bemessungstabelle unisoliert'!$H$67*'Bemessungstabelle unisoliert'!$H$68*'Bemessungstabelle unisoliert'!$H$69*'Bemessungstabelle unisoliert'!$H$70*'Bemessungstabelle unisoliert'!$H$71","v":{"$error":"#REF!"}},{"$f":"'Bemessungstabelle unisoliert'!$T76*'Bemessungstabelle unisoliert'!$H$66*'Bemessungstabelle unisoliert'!$H$67*'Bemessungstabelle unisoliert'!$H$68*'Bemessungstabelle unisoliert'!$H$69*'Bemessungstabelle unisoliert'!$H$70*'Bemessungstabelle unisoliert'!$H$71","v":{"v":3.3242664,"d":"3.32 m"}}]
[null,{"v":1,"d":"1.00 m"},{"$f":"'Bemessungstabelle isoliert'!$X2*'Bemessungstabelle isoliert'!$H$2*'Bemessungstabelle isoliert'!$H$3*'Bemessungstabelle isoliert'!$H$4*'Bemessungstabelle isoliert'!$H$5*'Bemessungstabelle isoliert'!$H$6","v":{"v":4.67432,"d":"4.67 m"}},{"$f":"'Bemessungstabelle isoliert'!$X3*'Bemessungstabelle isoliert'!$H$2*'Bemessungstabelle isoliert'!$H$3*'Bemessungstabelle isoliert'!$H$4*'Bemessungstabelle isoliert'!$H$5*'Bemessungstabelle isoliert'!$H$6","v":{"v":5.617039999999999,"d":"5.62 m"}},{"$f":"'Bemessungstabelle isoliert'!$X4*'Bemessungstabelle isoliert'!$H$2*'Bemessungstabelle isoliert'!$H$3*'Bemessungstabelle isoliert'!$H$4*'Bemessungstabelle isoliert'!$H$5*'Bemessungstabelle isoliert'!$H$6","v":{"v":6.05894,"d":"6.06 m"}},{"$f":"'Bemessungstabelle isoliert'!$X5*'Bemessungstabelle isoliert'!$H$2*'Bemessungstabelle isoliert'!$H$3*'Bemessungstabelle isoliert'!$H$4*'Bemessungstabelle isoliert'!$H$5*'Bemessungstabelle isoliert'!$H$6","v":{"v":6.284800000000001,"d":"6.28 m"}},{"$f":"'Bemessungstabelle isoliert'!$X6*'Bemessungstabelle isoliert'!$H$2*'Bemessungstabelle isoliert'!$H$3*'Bemessungstabelle isoliert'!$H$4*'Bemessungstabelle isoliert'!$H$5*'Bemessungstabelle isoliert'!$H$6","v":{"v":1.92472,"d":"1.92 m"}},{"$f":"'Bemessungstabelle isoliert'!$X7*'Bemessungstabelle isoliert'!$H$2*'Bemessungstabelle isoliert'!$H$3*'Bemessungstabelle isoliert'!$H$4*'Bemessungstabelle isoliert'!$H$5*'Bemessungstabelle isoliert'!$H$6","v":{"v":2.04256,"d":"2.04 m"}},{"$f":"'Bemessungstabelle isoliert'!$X8*'Bemessungstabelle isoliert'!$H$2*'Bemessungstabelle isoliert'!$H$3*'Bemessungstabelle isoliert'!$H$4*'Bemessungstabelle isoliert'!$H$5*'Bemessungstabelle isoliert'!$H$6","v":{"v":2.8478,"d":"2.85 m"}},{"$f":"'Bemessungstabelle isoliert'!$X9*'Bemessungstabelle isoliert'!$H$2*'Bemessungstabelle isoliert'!$H$3*'Bemessungstabelle isoliert'!$H$4*'Bemessungstabelle isoliert'!$H$5*'Bemessungstabelle isoliert'!$H$6","v":{"v":3.3780799999999997,"d":"3.38 m"}},{"$f":"'Bemessungstabelle isoliert'!$X10*'Bemessungstabelle isoliert'!$H$2*'Bemessungstabelle isoliert'!$H$3*'Bemessungstabelle isoliert'!$H$4*'Bemessungstabelle isoliert'!$H$5*'Bemessungstabelle isoliert'!$H$6","v":{"v":3.6530400000000003,"d":"3.65 m"}},{"$f":"'Bemessungstabelle isoliert'!$X11*'Bemessungstabelle isoliert'!$H$2*'Bemessungstabelle isoliert'!$H$3*'Bemessungstabelle isoliert'!$H$4*'Bemessungstabelle isoliert'!$H$5*'Bemessungstabelle isoliert'!$H$6","v":{"v":4.33062,"d":"4.33 m"}},{"$f":"'Bemessungstabelle isoliert'!$X12*'Bemessungstabelle isoliert'!$H$2*'Bemessungstabelle isoliert'!$H$3*'Bemessungstabelle isoliert'!$H$4*'Bemessungstabelle isoliert'!$H$5*'Bemessungstabelle isoliert'!$H$6","v":{"v":4.605580000000001,"d":"4.61 m"}},{"$f":"'Bemessungstabelle isoliert'!#REF!*'Bemessungstabelle isoliert'!$H$2*'Bemessungstabelle isoliert'!$H$3*'Bemessungstabelle isoliert'!$H$4*'Bemessungstabelle isoliert'!$H$5*'Bemessungstabelle isoliert'!$H$6","v":{"$error":"#REF!"}},{"$f":"'Bemessungstabelle isoliert'!#REF!*'Bemessungstabelle isoliert'!$H$2*'Bemessungstabelle isoliert'!$H$3*'Bemessungstabelle isoliert'!$H$4*'Bemessungstabelle isoliert'!$H$5*'Bemessungstabelle isoliert'!$H$6","v":{"$error":"#REF!"}},{"$f":"'Bemessungstabelle isoliert'!#REF!*'Bemessungstabelle isoliert'!$H$2*'Bemessungstabelle isoliert'!$H$3*'Bemessungstabelle isoliert'!$H$4*'Bemessungstabelle isoliert'!$H$5*'Bemessungstabelle isoliert'!$H$6","v":{"$error":"#REF!"}},{"$f":"'Bemessungstabelle isoliert'!#REF!*'Bemessungstabelle isoliert'!$H$2*'Bemessungstabelle isoliert'!$H$3*'Bemessungstabelle isoliert'!$H$4*'Bemessungstabelle isoliert'!$H$5*'Bemessungstabelle isoliert'!$H$6","v":{"$error":"#REF!"}},null,{"v":4.5,"d":"4.50 m"},{"$f":"'Bemessungstabelle isoliert'!$AB42*'Bemessungstabelle isoliert'!$H$42*'Bemessungstabelle isoliert'!$H$43*'Bemessungstabelle isoliert'!$H$44*'Bemessungstabelle isoliert'!$H$45*'Bemessungstabelle isoliert'!$H$46*'Bemessungstabelle isoliert'!#REF!*'Bemessungstabelle isoliert'!$H$47","v":{"$error":"#REF!"}},{"$f":"'Bemessungstabelle isoliert'!$AB43*'Bemessungstabelle isoliert'!$H$42*'Bemessungstabelle isoliert'!$H$43*'Bemessungstabelle isoliert'!$H$44*'Bemessungstabelle isoliert'!$H$45*'Bemessungstabelle isoliert'!$H$46*'Bemessungstabelle isoliert'!#REF!*'Bemessungstabelle isoliert'!$H$47","v":{"$error":"#REF!"}},{"$f":"'Bemessungstabelle isoliert'!$AB44*'Bemessungstabelle isoliert'!$H$42*'Bemessungstabelle isoliert'!$H$43*'Bemessungstabelle isoliert'!$H$44*'Bemessungstabelle isoliert'!$H$45*'Bemessungstabelle isoliert'!$H$46*'Bemessungstabelle isoliert'!#REF!*'Bemessungstabelle isoliert'!$H$47","v":{"$error":"#REF!"}},{"$f":"'Bemessungstabelle isoliert'!$AB45*'Bemessungstabelle isoliert'!$H$42*'Bemessungstabelle isoliert'!$H$43*'Bemessungstabelle isoliert'!$H$44*'Bemessungstabelle isoliert'!$H$45*'Bemessungstabelle isoliert'!$H$46*'Bemessungstabelle isoliert'!#REF!*'Bemessungstabelle isoliert'!$H$47","v":{"$error":"#REF!"}},{"$f":"'Bemessungstabelle isoliert'!$AB46*'Bemessungstabelle isoliert'!$H$42*'Bemessungstabelle isoliert'!$H$43*'Bemessungstabelle isoliert'!$H$44*'Bemessungstabelle isoliert'!$H$45*'Bemessungstabelle isoliert'!$H$46*'Bemessungstabelle isoliert'!#REF!*'Bemessungstabelle isoliert'!$H$47","v":{"$error":"#REF!"}},{"$f":"'Bemessungstabelle isoliert'!$AB47*'Bemessungstabelle isoliert'!$H$42*'Bemessungstabelle isoliert'!$H$43*'Bemessungstabelle isoliert'!$H$44*'Bemessungstabelle isoliert'!$H$45*'Bemessungstabelle isoliert'!$H$46*'Bemessungstabelle isoliert'!#REF!*'Bemessungstabelle isoliert'!$H$47","v":{"$error":"#REF!"}},{"$f":"'Bemessungstabelle isoliert'!$AB48*'Bemessungstabelle isoliert'!$H$42*'Bemessungstabelle isoliert'!$H$43*'Bemessungstabelle isoliert'!$H$44*'Bemessungstabelle isoliert'!$H$45*'Bemessungstabelle isoliert'!$H$46*'Bemessungstabelle isoliert'!#REF!*'Bemessungstabelle isoliert'!$H$47","v":{"$error":"#REF!"}},{"$f":"'Bemessungstabelle isoliert'!$AB49*'Bemessungstabelle isoliert'!$H$42*'Bemessungstabelle isoliert'!$H$43*'Bemessungstabelle isoliert'!$H$44*'Bemessungstabelle isoliert'!$H$45*'Bemessungstabelle isoliert'!$H$46*'Bemessungstabelle isoliert'!#REF!*'Bemessungstabelle isoliert'!$H$47","v":{"$error":"#REF!"}},{"$f":"'Bemessungstabelle isoliert'!$AB50*'Bemessungstabelle isoliert'!$H$42*'Bemessungstabelle isoliert'!$H$43*'Bemessungstabelle isoliert'!$H$44*'Bemessungstabelle isoliert'!$H$45*'Bemessungstabelle isoliert'!$H$46*'Bemessungstabelle isoliert'!#REF!*'Bemessungstabelle isoliert'!$H$47","v":{"$error":"#REF!"}},{"$f":"'Bemessungstabelle isoliert'!$AB51*'Bemessungstabelle isoliert'!$H$42*'Bemessungstabelle isoliert'!$H$43*'Bemessungstabelle isoliert'!$H$44*'Bemessungstabelle isoliert'!$H$45*'Bemessungstabelle isoliert'!$H$46*'Bemessungstabelle isoliert'!#REF!*'Bemessungstabelle isoliert'!$H$47","v":{"$error":"#REF!"}},null,{"v":5.5,"d":"5.50 m"},{"$f":"('Bemessungstabelle unisoliert'!$T75+'Bemessungstabelle unisoliert'!V75)/2*'Bemessungstabelle unisoliert'!$H$66*'Bemessungstabelle unisoliert'!$H$67*'Bemessungstabelle unisoliert'!$H$68*'Bemessungstabelle unisoliert'!$H$69*'Bemessungstabelle unisoliert'!$H$70*'Bemessungstabelle unisoliert'!$H$71","v":{"v":2.2055229,"d":"2.21 m"}},{"$f":"('Bemessungstabelle unisoliert'!#REF!+'Bemessungstabelle unisoliert'!#REF!)/2*'Bemessungstabelle unisoliert'!$H$66*'Bemessungstabelle unisoliert'!$H$67*'Bemessungstabelle unisoliert'!$H$68*'Bemessungstabelle unisoliert'!$H$69*'Bemessungstabelle unisoliert'!$H$70*'Bemessungstabelle unisoliert'!$H$71","v":{"$error":"#REF!"}},{"$f":"('Bemessungstabelle unisoliert'!$T74+'Bemessungstabelle unisoliert'!V74)/2*'Bemessungstabelle unisoliert'!$H$66*'Bemessungstabelle unisoliert'!$H$67*'Bemessungstabelle unisoliert'!$H$68*'Bemessungstabelle unisoliert'!$H$69*'Bemessungstabelle unisoliert'!$H$70*'Bemessungstabelle unisoliert'!$H$71","v":{"v":5.3334383999999995,"d":"5.33 m"}},{"$f":"('Bemessungstabelle unisoliert'!#REF!+'Bemessungstabelle unisoliert'!#REF!)/2*'Bemessungstabelle unisoliert'!$H$66*'Bemessungstabelle unisoliert'!$H$67*'Bemessungstabelle unisoliert'!$H$68*'Bemessungstabelle unisoliert'!$H$69*'Bemessungstabelle unisoliert'!$H$70*'Bemessungstabelle unisoliert'!$H$71","v":{"$error":"#REF!"}},{"$f":"('Bemessungstabelle unisoliert'!$T76+'Bemessungstabelle unisoliert'!V76)/2*'Bemessungstabelle unisoliert'!$H$66*'Bemessungstabelle unisoliert'!$H$67*'Bemessungstabelle unisoliert'!$H$68*'Bemessungstabelle unisoliert'!$H$69*'Bemessungstabelle unisoliert'!$H$70*'Bemessungstabelle unisoliert'!$H$71","v":{"v":3.2283741000000004,"d":"3.23 m"}}]
[null,{"v":1.1,"d":"1.10 m"},{"$f":"'Bemessungstabelle isoliert'!$Z2*'Bemessungstabelle isoliert'!$H$2*'Bemessungstabelle isoliert'!$H$3*'Bemessungstabelle isoliert'!$H$4*'Bemessungstabelle isoliert'!$H$5*'Bemessungstabelle isoliert'!$H$6","v":{"v":4.52702,"d":"4.53 m"}},{"$f":"'Bemessungstabelle isoliert'!$Z3*'Bemessungstabelle isoliert'!$H$2*'Bemessungstabelle isoliert'!$H$3*'Bemessungstabelle isoliert'!$H$4*'Bemessungstabelle isoliert'!$H$5*'Bemessungstabelle isoliert'!$H$6","v":{"v":5.459919999999999,"d":"5.46 m"}},{"$f":"'Bemessungstabelle isoliert'!$Z4*'Bemessungstabelle isoliert'!$H$2*'Bemessungstabelle isoliert'!$H$3*'Bemessungstabelle isoliert'!$H$4*'Bemessungstabelle isoliert'!$H$5*'Bemessungstabelle isoliert'!$H$6","v":{"v":5.88218,"d":"5.88 m"}},{"$f":"'Bemessungstabelle isoliert'!$Z5*'Bemessungstabelle isoliert'!$H$2*'Bemessungstabelle isoliert'!$H$3*'Bemessungstabelle isoliert'!$H$4*'Bemessungstabelle isoliert'!$H$5*'Bemessungstabelle isoliert'!$H$6","v":{"v":6.10804,"d":"6.11 m"}},{"$f":"'Bemessungstabelle isoliert'!$Z6*'Bemessungstabelle isoliert'!$H$2*'Bemessungstabelle isoliert'!$H$3*'Bemessungstabelle isoliert'!$H$4*'Bemessungstabelle isoliert'!$H$5*'Bemessungstabelle isoliert'!$H$6","v":{"v":1.8461599999999998,"d":"1.85 m"}},{"$f":"'Bemessungstabelle isoliert'!$Z7*'Bemessungstabelle isoliert'!$H$2*'Bemessungstabelle isoliert'!$H$3*'Bemessungstabelle isoliert'!$H$4*'Bemessungstabelle isoliert'!$H$5*'Bemessungstabelle isoliert'!$H$6","v":{"v":1.9738199999999997,"d":"1.97 m"}},{"$f":"'Bemessungstabelle isoliert'!$Z8*'Bemessungstabelle isoliert'!$H$2*'Bemessungstabelle isoliert'!$H$3*'Bemessungstabelle isoliert'!$H$4*'Bemessungstabelle isoliert'!$H$5*'Bemessungstabelle isoliert'!$H$6","v":{"v":2.7495999999999996,"d":"2.75 m"}},{"$f":"'Bemessungstabelle isoliert'!$Z9*'Bemessungstabelle isoliert'!$H$2*'Bemessungstabelle isoliert'!$H$3*'Bemessungstabelle isoliert'!$H$4*'Bemessungstabelle isoliert'!$H$5*'Bemessungstabelle isoliert'!$H$6","v":{"v":3.27988,"d":"3.28 m"}},{"$f":"'Bemessungstabelle isoliert'!$Z10*'Bemessungstabelle isoliert'!$H$2*'Bemessungstabelle isoliert'!$H$3*'Bemessungstabelle isoliert'!$H$4*'Bemessungstabelle isoliert'!$H$5*'Bemessungstabelle isoliert'!$H$6","v":{"v":3.5352,"d":"3.54 m"}},{"$f":"'Bemessungstabelle isoliert'!$Z11*'Bemessungstabelle isoliert'!$H$2*'Bemessungstabelle isoliert'!$H$3*'Bemessungstabelle isoliert'!$H$4*'Bemessungstabelle isoliert'!$H$5*'Bemessungstabelle isoliert'!$H$6","v":{"v":4.20296,"d":"4.20 m"}},{"$f":"'Bemessungstabelle isoliert'!$Z12*'Bemessungstabelle isoliert'!$H$2*'Bemessungstabelle isoliert'!$H$3*'Bemessungstabelle isoliert'!$H$4*'Bemessungstabelle isoliert'!$H$5*'Bemessungstabelle isoliert'!$H$6","v":{"v":4.477919999999999,"d":"4.48 m"}},{"$f":"'Bemessungstabelle isoliert'!#REF!*'Bemessungstabelle isoliert'!$H$2*'Bemessungstabelle isoliert'!$H$3*'Bemessungstabelle isoliert'!$H$4*'Bemessungstabelle isoliert'!$H$5*'Bemessungstabelle isoliert'!$H$6","v":{"$error":"#REF!"}},{"$f":"'Bemessungstabelle isoliert'!#REF!*'Bemessungstabelle isoliert'!$H$2*'Bemessungstabelle isoliert'!$H$3*'Bemessungstabelle isoliert'!$H$4*'Bemessungstabelle isoliert'!$H$5*'Bemessungstabelle isoliert'!$H$6","v":{"$error":"#REF!"}},{"$f":"'Bemessungstabelle isoliert'!#REF!*'Bemessungstabelle isoliert'!$H$2*'Bemessungstabelle isoliert'!$H$3*'Bemessungstabelle isoliert'!$H$4*'Bemessungstabelle isoliert'!$H$5*'Bemessungstabelle isoliert'!$H$6","v":{"$error":"#REF!"}},{"$f":"'Bemessungstabelle isoliert'!#REF!*'Bemessungstabelle isoliert'!$H$2*'Bemessungstabelle isoliert'!$H$3*'Bemessungstabelle isoliert'!$H$4*'Bemessungstabelle isoliert'!$H$5*'Bemessungstabelle isoliert'!$H$6","v":{"$error":"#REF!"}},null,{"v":5,"d":"5.00 m"},{"$f":"'Bemessungstabelle isoliert'!$AD42*'Bemessungstabelle isoliert'!$H$42*'Bemessungstabelle isoliert'!$H$43*'Bemessungstabelle isoliert'!$H$44*'Bemessungstabelle isoliert'!$H$45*'Bemessungstabelle isoliert'!$H$46*'Bemessungstabelle isoliert'!#REF!*'Bemessungstabelle isoliert'!$H$47","v":{"$error":"#REF!"}},{"$f":"'Bemessungstabelle isoliert'!$AD43*'Bemessungstabelle isoliert'!$H$42*'Bemessungstabelle isoliert'!$H$43*'Bemessungstabelle isoliert'!$H$44*'Bemessungstabelle isoliert'!$H$45*'Bemessungstabelle isoliert'!$H$46*'Bemessungstabelle isoliert'!#REF!*'Bemessungstabelle isoliert'!$H$47","v":{"$error":"#REF!"}},{"$f":"'Bemessungstabelle isoliert'!$AD44*'Bemessungstabelle isoliert'!$H$42*'Bemessungstabelle isoliert'!$H$43*'Bemessungstabelle isoliert'!$H$44*'Bemessungstabelle isoliert'!$H$45*'Bemessungstabelle isoliert'!$H$46*'Bemessungstabelle isoliert'!#REF!*'Bemessungstabelle isoliert'!$H$47","v":{"$error":"#REF!"}},{"$f":"'Bemessungstabelle isoliert'!$AD45*'Bemessungstabelle isoliert'!$H$42*'Bemessungstabelle isoliert'!$H$43*'Bemessungstabelle isoliert'!$H$44*'Bemessungstabelle isoliert'!$H$45*'Bemessungstabelle isoliert'!$H$46*'Bemessungstabelle isoliert'!#REF!*'Bemessungstabelle isoliert'!$H$47","v":{"$error":"#REF!"}},{"$f":"'Bemessungstabelle isoliert'!$AD46*'Bemessungstabelle isoliert'!$H$42*'Bemessungstabelle isoliert'!$H$43*'Bemessungstabelle isoliert'!$H$44*'Bemessungstabelle isoliert'!$H$45*'Bemessungstabelle isoliert'!$H$46*'Bemessungstabelle isoliert'!#REF!*'Bemessungstabelle isoliert'!$H$47","v":{"$error":"#REF!"}},{"$f":"'Bemessungstabelle isoliert'!$AD47*'Bemessungstabelle isoliert'!$H$42*'Bemessungstabelle isoliert'!$H$43*'Bemessungstabelle isoliert'!$H$44*'Bemessungstabelle isoliert'!$H$45*'Bemessungstabelle isoliert'!$H$46*'Bemessungstabelle isoliert'!#REF!*'Bemessungstabelle isoliert'!$H$47","v":{"$error":"#REF!"}},{"$f":"'Bemessungstabelle isoliert'!$AD48*'Bemessungstabelle isoliert'!$H$42*'Bemessungstabelle isoliert'!$H$43*'Bemessungstabelle isoliert'!$H$44*'Bemessungstabelle isoliert'!$H$45*'Bemessungstabelle isoliert'!$H$46*'Bemessungstabelle isoliert'!#REF!*'Bemessungstabelle isoliert'!$H$47","v":{"$error":"#REF!"}},{"$f":"'Bemessungstabelle isoliert'!$AD49*'Bemessungstabelle isoliert'!$H$42*'Bemessungstabelle isoliert'!$H$43*'Bemessungstabelle isoliert'!$H$44*'Bemessungstabelle isoliert'!$H$45*'Bemessungstabelle isoliert'!$H$46*'Bemessungstabelle isoliert'!#REF!*'Bemessungstabelle isoliert'!$H$47","v":{"$error":"#REF!"}},{"$f":"'Bemessungstabelle isoliert'!$AD50*'Bemessungstabelle isoliert'!$H$42*'Bemessungstabelle isoliert'!$H$43*'Bemessungstabelle isoliert'!$H$44*'Bemessungstabelle isoliert'!$H$45*'Bemessungstabelle isoliert'!$H$46*'Bemessungstabelle isoliert'!#REF!*'Bemessungstabelle isoliert'!$H$47","v":{"$error":"#REF!"}},{"$f":"'Bemessungstabelle isoliert'!$AD51*'Bemessungstabelle isoliert'!$H$42*'Bemessungstabelle isoliert'!$H$43*'Bemessungstabelle isoliert'!$H$44*'Bemessungstabelle isoliert'!$H$45*'Bemessungstabelle isoliert'!$H$46*'Bemessungstabelle isoliert'!#REF!*'Bemessungstabelle isoliert'!$H$47","v":{"$error":"#REF!"}}]
[{"$nulls":18},{"v":5.5,"d":"5.50 m"},{"$f":"'Bemessungstabelle isoliert'!$AF42*'Bemessungstabelle isoliert'!$H$42*'Bemessungstabelle isoliert'!$H$43*'Bemessungstabelle isoliert'!$H$44*'Bemessungstabelle isoliert'!$H$45*'Bemessungstabelle isoliert'!$H$46*'Bemessungstabelle isoliert'!#REF!*'Bemessungstabelle isoliert'!$H$47","v":{"$error":"#REF!"}},{"$f":"'Bemessungstabelle isoliert'!$AF43*'Bemessungstabelle isoliert'!$H$42*'Bemessungstabelle isoliert'!$H$43*'Bemessungstabelle isoliert'!$H$44*'Bemessungstabelle isoliert'!$H$45*'Bemessungstabelle isoliert'!$H$46*'Bemessungstabelle isoliert'!#REF!*'Bemessungstabelle isoliert'!$H$47","v":{"$error":"#REF!"}},{"$f":"'Bemessungstabelle isoliert'!$AF44*'Bemessungstabelle isoliert'!$H$42*'Bemessungstabelle isoliert'!$H$43*'Bemessungstabelle isoliert'!$H$44*'Bemessungstabelle isoliert'!$H$45*'Bemessungstabelle isoliert'!$H$46*'Bemessungstabelle isoliert'!#REF!*'Bemessungstabelle isoliert'!$H$47","v":{"$error":"#REF!"}},{"$f":"'Bemessungstabelle isoliert'!$AF45*'Bemessungstabelle isoliert'!$H$42*'Bemessungstabelle isoliert'!$H$43*'Bemessungstabelle isoliert'!$H$44*'Bemessungstabelle isoliert'!$H$45*'Bemessungstabelle isoliert'!$H$46*'Bemessungstabelle isoliert'!#REF!*'Bemessungstabelle isoliert'!$H$47","v":{"$error":"#REF!"}},{"$f":"'Bemessungstabelle isoliert'!$AF46*'Bemessungstabelle isoliert'!$H$42*'Bemessungstabelle isoliert'!$H$43*'Bemessungstabelle isoliert'!$H$44*'Bemessungstabelle isoliert'!$H$45*'Bemessungstabelle isoliert'!$H$46*'Bemessungstabelle isoliert'!#REF!*'Bemessungstabelle isoliert'!$H$47","v":{"$error":"#REF!"}},{"$f":"'Bemessungstabelle isoliert'!$AF47*'Bemessungstabelle isoliert'!$H$42*'Bemessungstabelle isoliert'!$H$43*'Bemessungstabelle isoliert'!$H$44*'Bemessungstabelle isoliert'!$H$45*'Bemessungstabelle isoliert'!$H$46*'Bemessungstabelle isoliert'!#REF!*'Bemessungstabelle isoliert'!$H$47","v":{"$error":"#REF!"}},{"$f":"'Bemessungstabelle isoliert'!$AF48*'Bemessungstabelle isoliert'!$H$42*'Bemessungstabelle isoliert'!$H$43*'Bemessungstabelle isoliert'!$H$44*'Bemessungstabelle isoliert'!$H$45*'Bemessungstabelle isoliert'!$H$46*'Bemessungstabelle isoliert'!#REF!*'Bemessungstabelle isoliert'!$H$47","v":{"$error":"#REF!"}},{"$f":"'Bemessungstabelle isoliert'!$AF49*'Bemessungstabelle isoliert'!$H$42*'Bemessungstabelle isoliert'!$H$43*'Bemessungstabelle isoliert'!$H$44*'Bemessungstabelle isoliert'!$H$45*'Bemessungstabelle isoliert'!$H$46*'Bemessungstabelle isoliert'!#REF!*'Bemessungstabelle isoliert'!$H$47","v":{"$error":"#REF!"}},{"$f":"'Bemessungstabelle isoliert'!$AF50*'Bemessungstabelle isoliert'!$H$42*'Bemessungstabelle isoliert'!$H$43*'Bemessungstabelle isoliert'!$H$44*'Bemessungstabelle isoliert'!$H$45*'Bemessungstabelle isoliert'!$H$46*'Bemessungstabelle isoliert'!#REF!*'Bemessungstabelle isoliert'!$H$47","v":{"$error":"#REF!"}},{"$f":"'Bemessungstabelle isoliert'!$AF51*'Bemessungstabelle isoliert'!$H$42*'Bemessungstabelle isoliert'!$H$43*'Bemessungstabelle isoliert'!$H$44*'Bemessungstabelle isoliert'!$H$45*'Bemessungstabelle isoliert'!$H$46*'Bemessungstabelle isoliert'!#REF!*'Bemessungstabelle isoliert'!$H$47","v":{"$error":"#REF!"}}]
[]
[null,"Träger unisoliert",{"$nulls":16},"Rinnen unisoliert"]
[]
[null,"Randbedingungen",{"$nulls":16},"Randbedingungen"]
[null,"Schneelast:",{"$f":"'Bemessungstabelle unisoliert'!D6","v":{"v":1.1,"d":"1.10 kN/qm"}},{"$nulls":15},"Schneelast:",{"$f":"'Bemessungstabelle unisoliert'!#REF!","v":{"$error":"#REF!"}}]
[null,"Windzone:",{"$f":"'Bemessungstabelle unisoliert'!D8","v":"1, Binnenland"},{"$nulls":15},"Windzone:",{"$f":"'Bemessungstabelle unisoliert'!#REF!","v":{"$error":"#REF!"}}]
[null,"Verglasung:",{"$f":"'Bemessungstabelle unisoliert'!D5","v":"10mm VSG"},{"$nulls":15},"Verglasung:",{"$f":"'Bemessungstabelle unisoliert'!#REF!","v":{"$error":"#REF!"}}]
[null,"Dachneigung:",{"$f":"'Bemessungstabelle unisoliert'!D9","v":{"v":10,"d":"10.0°"}},{"$nulls":15},"Dachneigung:",{"$f":"'Bemessungstabelle unisoliert'!#REF!","v":{"$error":"#REF!"}}]
[null,"Achsabstand:",{"$f":"'Bemessungstabelle unisoliert'!D12","v":{"v":0.85,"d":"0.85 m"}},{"$nulls":15},"Achsabstand:",{"$f":"'Bemessungstabelle unisoliert'!D12","v":{"v":0.85,"d":"0.85 m"}}]
[null,"zul. Durchbiegung:",{"$f":"'Bemessungstabelle unisoliert'!D13","v":"l/200"},{"$nulls":15},"zul. Durchbiegung:",{"$f":"'Bemessungstabelle unisoliert'!D27","v":"l/250"}]
[]
[null,"Sparrenabstand","26105","26105+100x10","26107","26107+100x10","541514","541514+110x15","541514+Z-Profil",{"$nulls":9},"Tiefe","26101","26101+100x20x3","545444","545444+120x50x3","545444+120x50x5","545444+I120","545444+U120"]
[null,{"v":0.5,"d":"0.50 m"},{"$f":"'Bemessungstabelle unisoliert'!$N2*'Bemessungstabelle unisoliert'!$H$2*'Bemessungstabelle unisoliert'!$H$3*'Bemessungstabelle unisoliert'!$H$4*'Bemessungstabelle unisoliert'!$H$5*'Bemessungstabelle unisoliert'!$H$6","v":{"v":3.3879,"d":"3.39 m"}},{"$f":"'Bemessungstabelle unisoliert'!$N3*'Bemessungstabelle unisoliert'!$H$2*'Bemessungstabelle unisoliert'!$H$3*'Bemessungstabelle unisoliert'!$H$4*'Bemessungstabelle unisoliert'!$H$5*'Bemessungstabelle unisoliert'!$H$6","v":{"v":4.75288,"d":"4.75 m"}},{"$f":"'Bemessungstabelle unisoliert'!$N6*'Bemessungstabelle unisoliert'!$H$2*'Bemessungstabelle unisoliert'!$H$3*'Bemessungstabelle unisoliert'!$H$4*'Bemessungstabelle unisoliert'!$H$5*'Bemessungstabelle unisoliert'!$H$6","v":{"v":4.53684,"d":"4.54 m"}},{"$f":"'Bemessungstabelle unisoliert'!$N7*'Bemessungstabelle unisoliert'!$H$2*'Bemessungstabelle unisoliert'!$H$3*'Bemessungstabelle unisoliert'!$H$4*'Bemessungstabelle unisoliert'!$H$5*'Bemessungstabelle unisoliert'!$H$6","v":{"v":5.38136,"d":"5.38 m"}},{"$f":"'Bemessungstabelle unisoliert'!$N8*'Bemessungstabelle unisoliert'!$H$2*'Bemessungstabelle unisoliert'!$H$3*'Bemessungstabelle unisoliert'!$H$4*'Bemessungstabelle unisoliert'!$H$5*'Bemessungstabelle unisoliert'!$H$6","v":{"v":5.22424,"d":"5.22 m"}},{"$f":"'Bemessungstabelle unisoliert'!$N9*'Bemessungstabelle unisoliert'!$H$2*'Bemessungstabelle unisoliert'!$H$3*'Bemessungstabelle unisoliert'!$H$4*'Bemessungstabelle unisoliert'!$H$5*'Bemessungstabelle unisoliert'!$H$6","v":{"v":5.85272,"d":"5.85 m"}},{"$f":"'Bemessungstabelle unisoliert'!$N13*'Bemessungstabelle unisoliert'!$H$2*'Bemessungstabelle unisoliert'!$H$3*'Bemessungstabelle unisoliert'!$H$4*'Bemessungstabelle unisoliert'!$H$5*'Bemessungstabelle unisoliert'!$H$6","v":{"v":3.5253799999999997,"d":"3.53 m"}},{"$nulls":9},{"v":2,"d":"2.00 m"},{"$f":"'Bemessungstabelle unisoliert'!$R57*'Bemessungstabelle unisoliert'!$H$51*'Bemessungstabelle unisoliert'!$H$52*'Bemessungstabelle unisoliert'!$H$53*'Bemessungstabelle unisoliert'!$H$54*'Bemessungstabelle unisoliert'!#REF!*'Bemessungstabelle unisoliert'!$H$55*'Bemessungstabelle unisoliert'!$H$56","v":{"$error":"#REF!"}},{"$f":"'Bemessungstabelle unisoliert'!$R58*'Bemessungstabelle unisoliert'!$H$51*'Bemessungstabelle unisoliert'!$H$52*'Bemessungstabelle unisoliert'!$H$53*'Bemessungstabelle unisoliert'!$H$54*'Bemessungstabelle unisoliert'!#REF!*'Bemessungstabelle unisoliert'!$H$55*'Bemessungstabelle unisoliert'!$H$56","v":{"$error":"#REF!"}},{"$f":"'Bemessungstabelle unisoliert'!$R60*'Bemessungstabelle unisoliert'!$H$51*'Bemessungstabelle unisoliert'!$H$52*'Bemessungstabelle unisoliert'!$H$53*'Bemessungstabelle unisoliert'!$H$54*'Bemessungstabelle unisoliert'!#REF!*'Bemessungstabelle unisoliert'!$H$55*'Bemessungstabelle unisoliert'!$H$56","v":{"$error":"#REF!"}},{"$f":"'Bemessungstabelle unisoliert'!$R61*'Bemessungstabelle unisoliert'!$H$51*'Bemessungstabelle unisoliert'!$H$52*'Bemessungstabelle unisoliert'!$H$53*'Bemessungstabelle unisoliert'!$H$54*'Bemessungstabelle unisoliert'!#REF!*'Bemessungstabelle unisoliert'!$H$55*'Bemessungstabelle unisoliert'!$H$56","v":{"$error":"#REF!"}},{"$f":"'Bemessungstabelle unisoliert'!$R62*'Bemessungstabelle unisoliert'!$H$51*'Bemessungstabelle unisoliert'!$H$52*'Bemessungstabelle unisoliert'!$H$53*'Bemessungstabelle unisoliert'!$H$54*'Bemessungstabelle unisoliert'!#REF!*'Bemessungstabelle unisoliert'!$H$55*'Bemessungstabelle unisoliert'!$H$56","v":{"$error":"#REF!"}},{"$f":"'Bemessungstabelle unisoliert'!$R63*'Bemessungstabelle unisoliert'!$H$51*'Bemessungstabelle unisoliert'!$H$52*'Bemessungstabelle unisoliert'!$H$53*'Bemessungstabelle unisoliert'!$H$54*'Bemessungstabelle unisoliert'!#REF!*'Bemessungstabelle unisoliert'!$H$55*'Bemessungstabelle unisoliert'!$H$56","v":{"$error":"#REF!"}},{"$f":"'Bemessungstabelle unisoliert'!$R64*'Bemessungstabelle unisoliert'!$H$51*'Bemessungstabelle unisoliert'!$H$52*'Bemessungstabelle unisoliert'!$H$53*'Bemessungstabelle unisoliert'!$H$54*'Bemessungstabelle unisoliert'!#REF!*'Bemessungstabelle unisoliert'!$H$55*'Bemessungstabelle unisoliert'!$H$56","v":{"$error":"#REF!"}}]
[null,{"v":0.6,"d":"0.60 m"},{"$f":"'Bemessungstabelle unisoliert'!$P2*'Bemessungstabelle unisoliert'!$H$2*'Bemessungstabelle unisoliert'!$H$3*'Bemessungstabelle unisoliert'!$H$4*'Bemessungstabelle unisoliert'!$H$5*'Bemessungstabelle unisoliert'!$H$6","v":{"v":3.1915,"d":"3.19 m"}},{"$f":"'Bemessungstabelle unisoliert'!$P3*'Bemessungstabelle unisoliert'!$H$2*'Bemessungstabelle unisoliert'!$H$3*'Bemessungstabelle unisoliert'!$H$4*'Bemessungstabelle unisoliert'!$H$5*'Bemessungstabelle unisoliert'!$H$6","v":{"v":4.49756,"d":"4.50 m"}},{"$f":"'Bemessungstabelle unisoliert'!$P6*'Bemessungstabelle unisoliert'!$H$2*'Bemessungstabelle unisoliert'!$H$3*'Bemessungstabelle unisoliert'!$H$4*'Bemessungstabelle unisoliert'!$H$5*'Bemessungstabelle unisoliert'!$H$6","v":{"v":4.28152,"d":"4.28 m"}},{"$f":"'Bemessungstabelle unisoliert'!$P7*'Bemessungstabelle unisoliert'!$H$2*'Bemessungstabelle unisoliert'!$H$3*'Bemessungstabelle unisoliert'!$H$4*'Bemessungstabelle unisoliert'!$H$5*'Bemessungstabelle unisoliert'!$H$6","v":{"v":5.1064,"d":"5.11 m"}},{"$f":"'Bemessungstabelle unisoliert'!$P8*'Bemessungstabelle unisoliert'!$H$2*'Bemessungstabelle unisoliert'!$H$3*'Bemessungstabelle unisoliert'!$H$4*'Bemessungstabelle unisoliert'!$H$5*'Bemessungstabelle unisoliert'!$H$6","v":{"v":4.929639999999999,"d":"4.93 m"}},{"$f":"'Bemessungstabelle unisoliert'!$P9*'Bemessungstabelle unisoliert'!$H$2*'Bemessungstabelle unisoliert'!$H$3*'Bemessungstabelle unisoliert'!$H$4*'Bemessungstabelle unisoliert'!$H$5*'Bemessungstabelle unisoliert'!$H$6","v":{"v":5.5483,"d":"5.55 m"}},{"$f":"'Bemessungstabelle unisoliert'!$P13*'Bemessungstabelle unisoliert'!$H$2*'Bemessungstabelle unisoliert'!$H$3*'Bemessungstabelle unisoliert'!$H$4*'Bemessungstabelle unisoliert'!$H$5*'Bemessungstabelle unisoliert'!$H$6","v":{"v":3.3191599999999997,"d":"3.32 m"}},{"$nulls":9},{"v":2.5,"d":"2.50 m"},{"$f":"'Bemessungstabelle unisoliert'!$T57*'Bemessungstabelle unisoliert'!$H$51*'Bemessungstabelle unisoliert'!$H$52*'Bemessungstabelle unisoliert'!$H$53*'Bemessungstabelle unisoliert'!$H$54*'Bemessungstabelle unisoliert'!#REF!*'Bemessungstabelle unisoliert'!$H$55*'Bemessungstabelle unisoliert'!$H$56","v":{"$error":"#REF!"}},{"$f":"'Bemessungstabelle unisoliert'!$T58*'Bemessungstabelle unisoliert'!$H$51*'Bemessungstabelle unisoliert'!$H$52*'Bemessungstabelle unisoliert'!$H$53*'Bemessungstabelle unisoliert'!$H$54*'Bemessungstabelle unisoliert'!#REF!*'Bemessungstabelle unisoliert'!$H$55*'Bemessungstabelle unisoliert'!$H$56","v":{"$error":"#REF!"}},{"$f":"'Bemessungstabelle unisoliert'!$T60*'Bemessungstabelle unisoliert'!$H$51*'Bemessungstabelle unisoliert'!$H$52*'Bemessungstabelle unisoliert'!$H$53*'Bemessungstabelle unisoliert'!$H$54*'Bemessungstabelle unisoliert'!#REF!*'Bemessungstabelle unisoliert'!$H$55*'Bemessungstabelle unisoliert'!$H$56","v":{"$error":"#REF!"}},{"$f":"'Bemessungstabelle unisoliert'!$T61*'Bemessungstabelle unisoliert'!$H$51*'Bemessungstabelle unisoliert'!$H$52*'Bemessungstabelle unisoliert'!$H$53*'Bemessungstabelle unisoliert'!$H$54*'Bemessungstabelle unisoliert'!#REF!*'Bemessungstabelle unisoliert'!$H$55*'Bemessungstabelle unisoliert'!$H$56","v":{"$error":"#REF!"}},{"$f":"'Bemessungstabelle unisoliert'!$T62*'Bemessungstabelle unisoliert'!$H$51*'Bemessungstabelle unisoliert'!$H$52*'Bemessungstabelle unisoliert'!$H$53*'Bemessungstabelle unisoliert'!$H$54*'Bemessungstabelle unisoliert'!#REF!*'Bemessungstabelle unisoliert'!$H$55*'Bemessungstabelle unisoliert'!$H$56","v":{"$error":"#REF!"}},{"$f":"'Bemessungstabelle unisoliert'!$T63*'Bemessungstabelle unisoliert'!$H$51*'Bemessungstabelle unisoliert'!$H$52*'Bemessungstabelle unisoliert'!$H$53*'Bemessungstabelle unisoliert'!$H$54*'Bemessungstabelle unisoliert'!#REF!*'Bemessungstabelle unisoliert'!$H$55*'Bemessungstabelle unisoliert'!$H$56","v":{"$error":"#REF!"}},{"$f":"'Bemessungstabelle unisoliert'!$T64*'Bemessungstabelle unisoliert'!$H$51*'Bemessungstabelle unisoliert'!$H$52*'Bemessungstabelle unisoliert'!$H$53*'Bemessungstabelle unisoliert'!$H$54*'Bemessungstabelle unisoliert'!#REF!*'Bemessungstabelle unisoliert'!$H$55*'Bemessungstabelle unisoliert'!$H$56","v":{"$error":"#REF!"}}]
[null,{"v":0.7,"d":"0.70 m"},{"$f":"'Bemessungstabelle unisoliert'!$R2*'Bemessungstabelle unisoliert'!$H$2*'Bemessungstabelle unisoliert'!$H$3*'Bemessungstabelle unisoliert'!$H$4*'Bemessungstabelle unisoliert'!$H$5*'Bemessungstabelle unisoliert'!$H$6","v":{"v":3.0442,"d":"3.04 m"}},{"$f":"'Bemessungstabelle unisoliert'!$R3*'Bemessungstabelle unisoliert'!$H$2*'Bemessungstabelle unisoliert'!$H$3*'Bemessungstabelle unisoliert'!$H$4*'Bemessungstabelle unisoliert'!$H$5*'Bemessungstabelle unisoliert'!$H$6","v":{"v":4.301159999999999,"d":"4.30 m"}},{"$f":"'Bemessungstabelle unisoliert'!$R6*'Bemessungstabelle unisoliert'!$H$2*'Bemessungstabelle unisoliert'!$H$3*'Bemessungstabelle unisoliert'!$H$4*'Bemessungstabelle unisoliert'!$H$5*'Bemessungstabelle unisoliert'!$H$6","v":{"v":4.0753,"d":"4.08 m"}},{"$f":"'Bemessungstabelle unisoliert'!$R7*'Bemessungstabelle unisoliert'!$H$2*'Bemessungstabelle unisoliert'!$H$3*'Bemessungstabelle unisoliert'!$H$4*'Bemessungstabelle unisoliert'!$H$5*'Bemessungstabelle unisoliert'!$H$6","v":{"v":4.8707199999999995,"d":"4.87 m"}},{"$f":"'Bemessungstabelle unisoliert'!$R8*'Bemessungstabelle unisoliert'!$H$2*'Bemessungstabelle unisoliert'!$H$3*'Bemessungstabelle unisoliert'!$H$4*'Bemessungstabelle unisoliert'!$H$5*'Bemessungstabelle unisoliert'!$H$6","v":{"v":4.693960000000001,"d":"4.69 m"}},{"$f":"'Bemessungstabelle unisoliert'!$R9*'Bemessungstabelle unisoliert'!$H$2*'Bemessungstabelle unisoliert'!$H$3*'Bemessungstabelle unisoliert'!$H$4*'Bemessungstabelle unisoliert'!$H$5*'Bemessungstabelle unisoliert'!$H$6","v":{"v":5.3028,"d":"5.30 m"}},{"$f":"'Bemessungstabelle unisoliert'!$R13*'Bemessungstabelle unisoliert'!$H$2*'Bemessungstabelle unisoliert'!$H$3*'Bemessungstabelle unisoliert'!$H$4*'Bemessungstabelle unisoliert'!$H$5*'Bemessungstabelle unisoliert'!$H$6","v":{"v":3.16204,"d":"3.16 m"}},{"$nulls":9},{"v":3,"d":"3.00 m"},{"$f":"'Bemessungstabelle unisoliert'!$V57*'Bemessungstabelle unisoliert'!$H$51*'Bemessungstabelle unisoliert'!$H$52*'Bemessungstabelle unisoliert'!$H$53*'Bemessungstabelle unisoliert'!$H$54*'Bemessungstabelle unisoliert'!#REF!*'Bemessungstabelle unisoliert'!$H$55*'Bemessungstabelle unisoliert'!$H$56","v":{"$error":"#REF!"}},{"$f":"'Bemessungstabelle unisoliert'!$V58*'Bemessungstabelle unisoliert'!$H$51*'Bemessungstabelle unisoliert'!$H$52*'Bemessungstabelle unisoliert'!$H$53*'Bemessungstabelle unisoliert'!$H$54*'Bemessungstabelle unisoliert'!#REF!*'Bemessungstabelle unisoliert'!$H$55*'Bemessungstabelle unisoliert'!$H$56","v":{"$error":"#REF!"}},{"$f":"'Bemessungstabelle unisoliert'!$V60*'Bemessungstabelle unisoliert'!$H$51*'Bemessungstabelle unisoliert'!$H$52*'Bemessungstabelle unisoliert'!$H$53*'Bemessungstabelle unisoliert'!$H$54*'Bemessungstabelle unisoliert'!#REF!*'Bemessungstabelle unisoliert'!$H$55*'Bemessungstabelle unisoliert'!$H$56","v":{"$error":"#REF!"}},{"$f":"'Bemessungstabelle unisoliert'!$V61*'Bemessungstabelle unisoliert'!$H$51*'Bemessungstabelle unisoliert'!$H$52*'Bemessungstabelle unisoliert'!$H$53*'Bemessungstabelle unisoliert'!$H$54*'Bemessungstabelle unisoliert'!#REF!*'Bemessungstabelle unisoliert'!$H$55*'Bemessungstabelle unisoliert'!$H$56","v":{"$error":"#REF!"}},{"$f":"'Bemessungstabelle unisoliert'!$V62*'Bemessungstabelle unisoliert'!$H$51*'Bemessungstabelle unisoliert'!$H$52*'Bemessungstabelle unisoliert'!$H$53*'Bemessungstabelle unisoliert'!$H$54*'Bemessungstabelle unisoliert'!#REF!*'Bemessungstabelle unisoliert'!$H$55*'Bemessungstabelle unisoliert'!$H$56","v":{"$error":"#REF!"}},{"$f":"'Bemessungstabelle unisoliert'!$V63*'Bemessungstabelle unisoliert'!$H$51*'Bemessungstabelle unisoliert'!$H$52*'Bemessungstabelle unisoliert'!$H$53*'Bemessungstabelle unisoliert'!$H$54*'Bemessungstabelle unisoliert'!#REF!*'Bemessungstabelle unisoliert'!$H$55*'Bemessungstabelle unisoliert'!$H$56","v":{"$error":"#REF!"}},{"$f":"'Bemessungstabelle unisoliert'!$V64*'Bemessungstabelle unisoliert'!$H$51*'Bemessungstabelle unisoliert'!$H$52*'Bemessungstabelle unisoliert'!$H$53*'Bemessungstabelle unisoliert'!$H$54*'Bemessungstabelle unisoliert'!#REF!*'Bemessungstabelle unisoliert'!$H$55*'Bemessungstabelle unisoliert'!$H$56","v":{"$error":"#REF!"}}]
[null,{"v":0.8,"d":"0.80 m"},{"$f":"'Bemessungstabelle unisoliert'!$T2*'Bemessungstabelle unisoliert'!$H$2*'Bemessungstabelle unisoliert'!$H$3*'Bemessungstabelle unisoliert'!$H$4*'Bemessungstabelle unisoliert'!$H$5*'Bemessungstabelle unisoliert'!$H$6","v":{"v":2.90672,"d":"2.91 m"}},{"$f":"'Bemessungstabelle unisoliert'!$T3*'Bemessungstabelle unisoliert'!$H$2*'Bemessungstabelle unisoliert'!$H$3*'Bemessungstabelle unisoliert'!$H$4*'Bemessungstabelle unisoliert'!$H$5*'Bemessungstabelle unisoliert'!$H$6","v":{"v":4.1244000000000005,"d":"4.12 m"}},{"$f":"'Bemessungstabelle unisoliert'!$T6*'Bemessungstabelle unisoliert'!$H$2*'Bemessungstabelle unisoliert'!$H$3*'Bemessungstabelle unisoliert'!$H$4*'Bemessungstabelle unisoliert'!$H$5*'Bemessungstabelle unisoliert'!$H$6","v":{"v":3.89854,"d":"3.90 m"}},{"$f":"'Bemessungstabelle unisoliert'!$T7*'Bemessungstabelle unisoliert'!$H$2*'Bemessungstabelle unisoliert'!$H$3*'Bemessungstabelle unisoliert'!$H$4*'Bemessungstabelle unisoliert'!$H$5*'Bemessungstabelle unisoliert'!$H$6","v":{"v":4.684139999999999,"d":"4.68 m"}},{"$f":"'Bemessungstabelle unisoliert'!$T8*'Bemessungstabelle unisoliert'!$H$2*'Bemessungstabelle unisoliert'!$H$3*'Bemessungstabelle unisoliert'!$H$4*'Bemessungstabelle unisoliert'!$H$5*'Bemessungstabelle unisoliert'!$H$6","v":{"v":4.49756,"d":"4.50 m"}},{"$f":"'Bemessungstabelle unisoliert'!$T9*'Bemessungstabelle unisoliert'!$H$2*'Bemessungstabelle unisoliert'!$H$3*'Bemessungstabelle unisoliert'!$H$4*'Bemessungstabelle unisoliert'!$H$5*'Bemessungstabelle unisoliert'!$H$6","v":{"v":5.08676,"d":"5.09 m"}},{"$f":"'Bemessungstabelle unisoliert'!$T13*'Bemessungstabelle unisoliert'!$H$2*'Bemessungstabelle unisoliert'!$H$3*'Bemessungstabelle unisoliert'!$H$4*'Bemessungstabelle unisoliert'!$H$5*'Bemessungstabelle unisoliert'!$H$6","v":{"v":3.02456,"d":"3.02 m"}},{"$nulls":9},{"v":3.5,"d":"3.50 m"},{"$f":"'Bemessungstabelle unisoliert'!$X57*'Bemessungstabelle unisoliert'!$H$51*'Bemessungstabelle unisoliert'!$H$52*'Bemessungstabelle unisoliert'!$H$53*'Bemessungstabelle unisoliert'!$H$54*'Bemessungstabelle unisoliert'!#REF!*'Bemessungstabelle unisoliert'!$H$55*'Bemessungstabelle unisoliert'!$H$56","v":{"$error":"#REF!"}},{"$f":"'Bemessungstabelle unisoliert'!$X58*'Bemessungstabelle unisoliert'!$H$51*'Bemessungstabelle unisoliert'!$H$52*'Bemessungstabelle unisoliert'!$H$53*'Bemessungstabelle unisoliert'!$H$54*'Bemessungstabelle unisoliert'!#REF!*'Bemessungstabelle unisoliert'!$H$55*'Bemessungstabelle unisoliert'!$H$56","v":{"$error":"#REF!"}},{"$f":"'Bemessungstabelle unisoliert'!$X60*'Bemessungstabelle unisoliert'!$H$51*'Bemessungstabelle unisoliert'!$H$52*'Bemessungstabelle unisoliert'!$H$53*'Bemessungstabelle unisoliert'!$H$54*'Bemessungstabelle unisoliert'!#REF!*'Bemessungstabelle unisoliert'!$H$55*'Bemessungstabelle unisoliert'!$H$56","v":{"$error":"#REF!"}},{"$f":"'Bemessungstabelle unisoliert'!$X61*'Bemessungstabelle unisoliert'!$H$51*'Bemessungstabelle unisoliert'!$H$52*'Bemessungstabelle unisoliert'!$H$53*'Bemessungstabelle unisoliert'!$H$54*'Bemessungstabelle unisoliert'!#REF!*'Bemessungstabelle unisoliert'!$H$55*'Bemessungstabelle unisoliert'!$H$56","v":{"$error":"#REF!"}},{"$f":"'Bemessungstabelle unisoliert'!$X62*'Bemessungstabelle unisoliert'!$H$51*'Bemessungstabelle unisoliert'!$H$52*'Bemessungstabelle unisoliert'!$H$53*'Bemessungstabelle unisoliert'!$H$54*'Bemessungstabelle unisoliert'!#REF!*'Bemessungstabelle unisoliert'!$H$55*'Bemessungstabelle unisoliert'!$H$56","v":{"$error":"#REF!"}},{"$f":"'Bemessungstabelle unisoliert'!$X63*'Bemessungstabelle unisoliert'!$H$51*'Bemessungstabelle unisoliert'!$H$52*'Bemessungstabelle unisoliert'!$H$53*'Bemessungstabelle unisoliert'!$H$54*'Bemessungstabelle unisoliert'!#REF!*'Bemessungstabelle unisoliert'!$H$55*'Bemessungstabelle unisoliert'!$H$56","v":{"$error":"#REF!"}},{"$f":"'Bemessungstabelle unisoliert'!$X64*'Bemessungstabelle unisoliert'!$H$51*'Bemessungstabelle unisoliert'!$H$52*'Bemessungstabelle unisoliert'!$H$53*'Bemessungstabelle unisoliert'!$H$54*'Bemessungstabelle unisoliert'!#REF!*'Bemessungstabelle unisoliert'!$H$55*'Bemessungstabelle unisoliert'!$H$56","v":{"$error":"#REF!"}}]
[null,{"v":0.9,"d":"0.90 m"},{"$f":"'Bemessungstabelle unisoliert'!$V2*'Bemessungstabelle unisoliert'!$H$2*'Bemessungstabelle unisoliert'!$H$3*'Bemessungstabelle unisoliert'!$H$4*'Bemessungstabelle unisoliert'!$H$5*'Bemessungstabelle unisoliert'!$H$6","v":{"v":2.7987,"d":"2.80 m"}},{"$f":"'Bemessungstabelle unisoliert'!$V3*'Bemessungstabelle unisoliert'!$H$2*'Bemessungstabelle unisoliert'!$H$3*'Bemessungstabelle unisoliert'!$H$4*'Bemessungstabelle unisoliert'!$H$5*'Bemessungstabelle unisoliert'!$H$6","v":{"v":3.9770999999999996,"d":"3.98 m"}},{"$f":"'Bemessungstabelle unisoliert'!$V6*'Bemessungstabelle unisoliert'!$H$2*'Bemessungstabelle unisoliert'!$H$3*'Bemessungstabelle unisoliert'!$H$4*'Bemessungstabelle unisoliert'!$H$5*'Bemessungstabelle unisoliert'!$H$6","v":{"v":3.7512399999999997,"d":"3.75 m"}},{"$f":"'Bemessungstabelle unisoliert'!$V7*'Bemessungstabelle unisoliert'!$H$2*'Bemessungstabelle unisoliert'!$H$3*'Bemessungstabelle unisoliert'!$H$4*'Bemessungstabelle unisoliert'!$H$5*'Bemessungstabelle unisoliert'!$H$6","v":{"v":4.5172,"d":"4.52 m"}},{"$f":"'Bemessungstabelle unisoliert'!$V8*'Bemessungstabelle unisoliert'!$H$2*'Bemessungstabelle unisoliert'!$H$3*'Bemessungstabelle unisoliert'!$H$4*'Bemessungstabelle unisoliert'!$H$5*'Bemessungstabelle unisoliert'!$H$6","v":{"v":4.33062,"d":"4.33 m"}},{"$f":"'Bemessungstabelle unisoliert'!$V9*'Bemessungstabelle unisoliert'!$H$2*'Bemessungstabelle unisoliert'!$H$3*'Bemessungstabelle unisoliert'!$H$4*'Bemessungstabelle unisoliert'!$H$5*'Bemessungstabelle unisoliert'!$H$6","v":{"v":4.91,"d":"4.91 m"}},{"$f":"'Bemessungstabelle unisoliert'!$V13*'Bemessungstabelle unisoliert'!$H$2*'Bemessungstabelle unisoliert'!$H$3*'Bemessungstabelle unisoliert'!$H$4*'Bemessungstabelle unisoliert'!$H$5*'Bemessungstabelle unisoliert'!$H$6","v":{"v":2.90672,"d":"2.91 m"}},{"$nulls":9},{"v":4,"d":"4.00 m"},{"$f":"'Bemessungstabelle unisoliert'!$Z57*'Bemessungstabelle unisoliert'!$H$51*'Bemessungstabelle unisoliert'!$H$52*'Bemessungstabelle unisoliert'!$H$53*'Bemessungstabelle unisoliert'!$H$54*'Bemessungstabelle unisoliert'!#REF!*'Bemessungstabelle unisoliert'!$H$55*'Bemessungstabelle unisoliert'!$H$56","v":{"$error":"#REF!"}},{"$f":"'Bemessungstabelle unisoliert'!$Z58*'Bemessungstabelle unisoliert'!$H$51*'Bemessungstabelle unisoliert'!$H$52*'Bemessungstabelle unisoliert'!$H$53*'Bemessungstabelle unisoliert'!$H$54*'Bemessungstabelle unisoliert'!#REF!*'Bemessungstabelle unisoliert'!$H$55*'Bemessungstabelle unisoliert'!$H$56","v":{"$error":"#REF!"}},{"$f":"'Bemessungstabelle unisoliert'!$Z60*'Bemessungstabelle unisoliert'!$H$51*'Bemessungstabelle unisoliert'!$H$52*'Bemessungstabelle unisoliert'!$H$53*'Bemessungstabelle unisoliert'!$H$54*'Bemessungstabelle unisoliert'!#REF!*'Bemessungstabelle unisoliert'!$H$55*'Bemessungstabelle unisoliert'!$H$56","v":{"$error":"#REF!"}},{"$f":"'Bemessungstabelle unisoliert'!$Z61*'Bemessungstabelle unisoliert'!$H$51*'Bemessungstabelle unisoliert'!$H$52*'Bemessungstabelle unisoliert'!$H$53*'Bemessungstabelle unisoliert'!$H$54*'Bemessungstabelle unisoliert'!#REF!*'Bemessungstabelle unisoliert'!$H$55*'Bemessungstabelle unisoliert'!$H$56","v":{"$error":"#REF!"}},{"$f":"'Bemessungstabelle unisoliert'!$Z62*'Bemessungstabelle unisoliert'!$H$51*'Bemessungstabelle unisoliert'!$H$52*'Bemessungstabelle unisoliert'!$H$53*'Bemessungstabelle unisoliert'!$H$54*'Bemessungstabelle unisoliert'!#REF!*'Bemessungstabelle unisoliert'!$H$55*'Bemessungstabelle unisoliert'!$H$56","v":{"$error":"#REF!"}},{"$f":"'Bemessungstabelle unisoliert'!$Z63*'Bemessungstabelle unisoliert'!$H$51*'Bemessungstabelle unisoliert'!$H$52*'Bemessungstabelle unisoliert'!$H$53*'Bemessungstabelle unisoliert'!$H$54*'Bemessungstabelle unisoliert'!#REF!*'Bemessungstabelle unisoliert'!$H$55*'Bemessungstabelle unisoliert'!$H$56","v":{"$error":"#REF!"}},{"$f":"'Bemessungstabelle unisoliert'!$Z64*'Bemessungstabelle unisoliert'!$H$51*'Bemessungstabelle unisoliert'!$H$52*'Bemessungstabelle unisoliert'!$H$53*'Bemessungstabelle unisoliert'!$H$54*'Bemessungstabelle unisoliert'!#REF!*'Bemessungstabelle unisoliert'!$H$55*'Bemessungstabelle unisoliert'!$H$56","v":{"$error":"#REF!"}}]
[null,{"v":1,"d":"1.00 m"},{"$f":"'Bemessungstabelle unisoliert'!$X2*'Bemessungstabelle unisoliert'!$H$2*'Bemessungstabelle unisoliert'!$H$3*'Bemessungstabelle unisoliert'!$H$4*'Bemessungstabelle unisoliert'!$H$5*'Bemessungstabelle unisoliert'!$H$6","v":{"v":2.7005,"d":"2.70 m"}},{"$f":"'Bemessungstabelle unisoliert'!$X3*'Bemessungstabelle unisoliert'!$H$2*'Bemessungstabelle unisoliert'!$H$3*'Bemessungstabelle unisoliert'!$H$4*'Bemessungstabelle unisoliert'!$H$5*'Bemessungstabelle unisoliert'!$H$6","v":{"v":3.84944,"d":"3.85 m"}},{"$f":"'Bemessungstabelle unisoliert'!$X6*'Bemessungstabelle unisoliert'!$H$2*'Bemessungstabelle unisoliert'!$H$3*'Bemessungstabelle unisoliert'!$H$4*'Bemessungstabelle unisoliert'!$H$5*'Bemessungstabelle unisoliert'!$H$6","v":{"v":3.62358,"d":"3.62 m"}},{"$f":"'Bemessungstabelle unisoliert'!$X7*'Bemessungstabelle unisoliert'!$H$2*'Bemessungstabelle unisoliert'!$H$3*'Bemessungstabelle unisoliert'!$H$4*'Bemessungstabelle unisoliert'!$H$5*'Bemessungstabelle unisoliert'!$H$6","v":{"v":4.3699,"d":"4.37 m"}},{"$f":"'Bemessungstabelle unisoliert'!$X8*'Bemessungstabelle unisoliert'!$H$2*'Bemessungstabelle unisoliert'!$H$3*'Bemessungstabelle unisoliert'!$H$4*'Bemessungstabelle unisoliert'!$H$5*'Bemessungstabelle unisoliert'!$H$6","v":{"v":4.18332,"d":"4.18 m"}},{"$f":"'Bemessungstabelle unisoliert'!$X9*'Bemessungstabelle unisoliert'!$H$2*'Bemessungstabelle unisoliert'!$H$3*'Bemessungstabelle unisoliert'!$H$4*'Bemessungstabelle unisoliert'!$H$5*'Bemessungstabelle unisoliert'!$H$6","v":{"v":4.75288,"d":"4.75 m"}},{"$f":"'Bemessungstabelle unisoliert'!$X13*'Bemessungstabelle unisoliert'!$H$2*'Bemessungstabelle unisoliert'!$H$3*'Bemessungstabelle unisoliert'!$H$4*'Bemessungstabelle unisoliert'!$H$5*'Bemessungstabelle unisoliert'!$H$6","v":{"v":2.8085199999999997,"d":"2.81 m"}},{"$nulls":9},{"v":4.5,"d":"4.50 m"},{"$f":"'Bemessungstabelle unisoliert'!$AB57*'Bemessungstabelle unisoliert'!$H$51*'Bemessungstabelle unisoliert'!$H$52*'Bemessungstabelle unisoliert'!$H$53*'Bemessungstabelle unisoliert'!$H$54*'Bemessungstabelle unisoliert'!#REF!*'Bemessungstabelle unisoliert'!$H$55*'Bemessungstabelle unisoliert'!$H$56","v":{"$error":"#REF!"}},{"$f":"'Bemessungstabelle unisoliert'!$AB58*'Bemessungstabelle unisoliert'!$H$51*'Bemessungstabelle unisoliert'!$H$52*'Bemessungstabelle unisoliert'!$H$53*'Bemessungstabelle unisoliert'!$H$54*'Bemessungstabelle unisoliert'!#REF!*'Bemessungstabelle unisoliert'!$H$55*'Bemessungstabelle unisoliert'!$H$56","v":{"$error":"#REF!"}},{"$f":"'Bemessungstabelle unisoliert'!$AB60*'Bemessungstabelle unisoliert'!$H$51*'Bemessungstabelle unisoliert'!$H$52*'Bemessungstabelle unisoliert'!$H$53*'Bemessungstabelle unisoliert'!$H$54*'Bemessungstabelle unisoliert'!#REF!*'Bemessungstabelle unisoliert'!$H$55*'Bemessungstabelle unisoliert'!$H$56","v":{"$error":"#REF!"}},{"$f":"'Bemessungstabelle unisoliert'!$AB61*'Bemessungstabelle unisoliert'!$H$51*'Bemessungstabelle unisoliert'!$H$52*'Bemessungstabelle unisoliert'!$H$53*'Bemessungstabelle unisoliert'!$H$54*'Bemessungstabelle unisoliert'!#REF!*'Bemessungstabelle unisoliert'!$H$55*'Bemessungstabelle unisoliert'!$H$56","v":{"$error":"#REF!"}},{"$f":"'Bemessungstabelle unisoliert'!$AB62*'Bemessungstabelle unisoliert'!$H$51*'Bemessungstabelle unisoliert'!$H$52*'Bemessungstabelle unisoliert'!$H$53*'Bemessungstabelle unisoliert'!$H$54*'Bemessungstabelle unisoliert'!#REF!*'Bemessungstabelle unisoliert'!$H$55*'Bemessungstabelle unisoliert'!$H$56","v":{"$error":"#REF!"}},{"$f":"'Bemessungstabelle unisoliert'!$AB63*'Bemessungstabelle unisoliert'!$H$51*'Bemessungstabelle unisoliert'!$H$52*'Bemessungstabelle unisoliert'!$H$53*'Bemessungstabelle unisoliert'!$H$54*'Bemessungstabelle unisoliert'!#REF!*'Bemessungstabelle unisoliert'!$H$55*'Bemessungstabelle unisoliert'!$H$56","v":{"$error":"#REF!"}},{"$f":"'Bemessungstabelle unisoliert'!$AB64*'Bemessungstabelle unisoliert'!$H$51*'Bemessungstabelle unisoliert'!$H$52*'Bemessungstabelle unisoliert'!$H$53*'Bemessungstabelle unisoliert'!$H$54*'Bemessungstabelle unisoliert'!#REF!*'Bemessungstabelle unisoliert'!$H$55*'Bemessungstabelle unisoliert'!$H$56","v":{"$error":"#REF!"}}]
[null,{"v":1.1,"d":"1.10 m"},{"$f":"'Bemessungstabelle unisoliert'!$Z2*'Bemessungstabelle unisoliert'!$H$2*'Bemessungstabelle unisoliert'!$H$3*'Bemessungstabelle unisoliert'!$H$4*'Bemessungstabelle unisoliert'!$H$5*'Bemessungstabelle unisoliert'!$H$6","v":{"v":2.62194,"d":"2.62 m"}},{"$f":"'Bemessungstabelle unisoliert'!$Z3*'Bemessungstabelle unisoliert'!$H$2*'Bemessungstabelle unisoliert'!$H$3*'Bemessungstabelle unisoliert'!$H$4*'Bemessungstabelle unisoliert'!$H$5*'Bemessungstabelle unisoliert'!$H$6","v":{"v":3.74142,"d":"3.74 m"}},{"$f":"'Bemessungstabelle unisoliert'!$Z6*'Bemessungstabelle unisoliert'!$H$2*'Bemessungstabelle unisoliert'!$H$3*'Bemessungstabelle unisoliert'!$H$4*'Bemessungstabelle unisoliert'!$H$5*'Bemessungstabelle unisoliert'!$H$6","v":{"v":3.51556,"d":"3.52 m"}},{"$f":"'Bemessungstabelle unisoliert'!$Z7*'Bemessungstabelle unisoliert'!$H$2*'Bemessungstabelle unisoliert'!$H$3*'Bemessungstabelle unisoliert'!$H$4*'Bemessungstabelle unisoliert'!$H$5*'Bemessungstabelle unisoliert'!$H$6","v":{"v":4.24224,"d":"4.24 m"}},{"$f":"'Bemessungstabelle unisoliert'!$Z8*'Bemessungstabelle unisoliert'!$H$2*'Bemessungstabelle unisoliert'!$H$3*'Bemessungstabelle unisoliert'!$H$4*'Bemessungstabelle unisoliert'!$H$5*'Bemessungstabelle unisoliert'!$H$6","v":{"v":4.05566,"d":"4.06 m"}},{"$f":"'Bemessungstabelle unisoliert'!$Z9*'Bemessungstabelle unisoliert'!$H$2*'Bemessungstabelle unisoliert'!$H$3*'Bemessungstabelle unisoliert'!$H$4*'Bemessungstabelle unisoliert'!$H$5*'Bemessungstabelle unisoliert'!$H$6","v":{"v":4.6154,"d":"4.62 m"}},{"$f":"'Bemessungstabelle unisoliert'!$Z13*'Bemessungstabelle unisoliert'!$H$2*'Bemessungstabelle unisoliert'!$H$3*'Bemessungstabelle unisoliert'!$H$4*'Bemessungstabelle unisoliert'!$H$5*'Bemessungstabelle unisoliert'!$H$6","v":{"v":2.72014,"d":"2.72 m"}},{"$nulls":9},{"v":5,"d":"5.00 m"},{"$f":"'Bemessungstabelle unisoliert'!$AD57*'Bemessungstabelle unisoliert'!$H$51*'Bemessungstabelle unisoliert'!$H$52*'Bemessungstabelle unisoliert'!$H$53*'Bemessungstabelle unisoliert'!$H$54*'Bemessungstabelle unisoliert'!#REF!*'Bemessungstabelle unisoliert'!$H$55*'Bemessungstabelle unisoliert'!$H$56","v":{"$error":"#REF!"}},{"$f":"'Bemessungstabelle unisoliert'!$AD58*'Bemessungstabelle unisoliert'!$H$51*'Bemessungstabelle unisoliert'!$H$52*'Bemessungstabelle unisoliert'!$H$53*'Bemessungstabelle unisoliert'!$H$54*'Bemessungstabelle unisoliert'!#REF!*'Bemessungstabelle unisoliert'!$H$55*'Bemessungstabelle unisoliert'!$H$56","v":{"$error":"#REF!"}},{"$f":"'Bemessungstabelle unisoliert'!$AD60*'Bemessungstabelle unisoliert'!$H$51*'Bemessungstabelle unisoliert'!$H$52*'Bemessungstabelle unisoliert'!$H$53*'Bemessungstabelle unisoliert'!$H$54*'Bemessungstabelle unisoliert'!#REF!*'Bemessungstabelle unisoliert'!$H$55*'Bemessungstabelle unisoliert'!$H$56","v":{"$error":"#REF!"}},{"$f":"'Bemessungstabelle unisoliert'!$AD61*'Bemessungstabelle unisoliert'!$H$51*'Bemessungstabelle unisoliert'!$H$52*'Bemessungstabelle unisoliert'!$H$53*'Bemessungstabelle unisoliert'!$H$54*'Bemessungstabelle unisoliert'!#REF!*'Bemessungstabelle unisoliert'!$H$55*'Bemessungstabelle unisoliert'!$H$56","v":{"$error":"#REF!"}},{"$f":"'Bemessungstabelle unisoliert'!$AD62*'Bemessungstabelle unisoliert'!$H$51*'Bemessungstabelle unisoliert'!$H$52*'Bemessungstabelle unisoliert'!$H$53*'Bemessungstabelle unisoliert'!$H$54*'Bemessungstabelle unisoliert'!#REF!*'Bemessungstabelle unisoliert'!$H$55*'Bemessungstabelle unisoliert'!$H$56","v":{"$error":"#REF!"}},{"$f":"'Bemessungstabelle unisoliert'!$AD63*'Bemessungstabelle unisoliert'!$H$51*'Bemessungstabelle unisoliert'!$H$52*'Bemessungstabelle unisoliert'!$H$53*'Bemessungstabelle unisoliert'!$H$54*'Bemessungstabelle unisoliert'!#REF!*'Bemessungstabelle unisoliert'!$H$55*'Bemessungstabelle unisoliert'!$H$56","v":{"$error":"#REF!"}},{"$f":"'Bemessungstabelle unisoliert'!$AD64*'Bemessungstabelle unisoliert'!$H$51*'Bemessungstabelle unisoliert'!$H$52*'Bemessungstabelle unisoliert'!$H$53*'Bemessungstabelle unisoliert'!$H$54*'Bemessungstabelle unisoliert'!#REF!*'Bemessungstabelle unisoliert'!$H$55*'Bemessungstabelle unisoliert'!$H$56","v":{"$error":"#REF!"}}]